{"text_format":"3","workbook":"xlsx","n_sheets":3,"sheets":["NGC024","Integrale","Feuil3"],"not_rendered":{"charts":1},"read":"whole","date_system":"1900"}

{"sheet":"NGC024","index":0,"n_rows":71,"n_cols":15,"rows_kept":71,"merged":[[9,2,9,3],[13,9,13,14]]}
[]
[]
[null,"ρ(r) = ρ0sech^8( r/ r_c)"]
[]
[]
["M(R) =4πρ0,r_c^3 ·I(u)",null,"u = R/r_c","I(u) = Integrale de 0 à u de ( x^2sech^8(x)dx",{"$nulls":3},"V_TURI(R) = Racine (G·M(R)/R)"]
[]
[{"$nulls":7},"G=",{"$f":"4.3009*POWER(10,-6)","v":4.3009000000000006E-6},"10^-6,KPC,(Km/s)^2/Mo"]
["NGC0247","R_max=",{"$f":"A40","v":14.54},"V_obs(R_max)=",{"$f":"B40","v":107}]
[null,"M_totale=","V_obs^2(R_max).R_max/G=",null,{"$f":"E9*E9*C9/I8","v":38705494198.888596},"Mo","I(infini)=",0.0648738184]
[{"$nulls":6},"M(R) = racine(G,M(R)/R)"]
[null,"r_c=R_max/1,2=",{"$f":"C9/1.2","v":12.116666666666667},"ρ0=M_tot/4.π.r_c^3.I(infini)/1,17=",{"$f":"E10/(POWER(C12,3)*4*3.14159*H10)/1.17","v":22811734.89669367},"Mo/kpc^3","π=",3.14159]
[]
["R","V_obs","Incer V_obs","u=R/r-c","I(U) par table","M(R) ","V_TURI","Erreur %",null,"calculs intermediaires de I(u)"]
[1.08,34.6,0.9,{"$f":"A15/$C$12","v":0.0891334250343879},{"$f":"N15*K15+O15*M15","v":2.3363919559834945E-4},{"$f":"4*$H$12*$E$12*POWER($C$12,3)*E15","v":119141481.67419085},{"$f":"POWER($I$8*F15/A15,0.5)","v":21.782077208799855},{"$f":"ROUND(ABS((B15-G15)/B15)*100,2)","v":37.05},null,{"$f":"INDEX(Integrale!$H$3:$H$502,MATCH('NGC024'!D15,Integrale!$H$3:$H$502,1))","v":0.08},{"$f":"INDEX(Integrale!$I$3:$I$502,MATCH('NGC024'!D15,Integrale!$H$3:$H$502,1))","v":1.693376E-4},{"$f":"INDEX(Integrale!$H$3:$H$502,MATCH('NGC024'!D15,Integrale!$H$3:$H$502,1)+1)","v":0.09},{"$f":"INDEX(Integrale!$I$3:$I$502,MATCH('NGC024'!D15,Integrale!$H$3:$H$502,1)+1)","v":0.0002397401},{"$f":"(L15-D15)/(L15-J15)","v":0.08665749656120995},{"$f":"(D15-J15)/(L15-J15)","v":0.9133425034387901}]
[1.61,47,0.8,{"$f":"A16/$C$12","v":0.1328748280605227},{"$f":"N16*K16+O16*M16","v":0.000754044770976616},{"$f":"4*$H$12*$E$12*POWER($C$12,3)*E16","v":384516009.9646594},32.049698472985966,31.81,null,{"$f":"INDEX(Integrale!$H$3:$H$502,MATCH('NGC024'!D16,Integrale!$H$3:$H$502,1))","v":0.13},{"$f":"INDEX(Integrale!$I$3:$I$502,MATCH('NGC024'!D16,Integrale!$H$3:$H$502,1))","v":0.0007052805},{"$f":"INDEX(Integrale!$H$3:$H$502,MATCH('NGC024'!D16,Integrale!$H$3:$H$502,1)+1)","v":0.14},{"$f":"INDEX(Integrale!$I$3:$I$502,MATCH('NGC024'!D16,Integrale!$H$3:$H$502,1)+1)","v":0.0008749055},{"$f":"(L16-D16)/(L16-J16)","v":0.7125171939477308},0.2874828060522691]
[2.15,59.1,3.1,0.17744154057771663,1.7330391850068775E-3,883742369.3929641,42.04586397557061,28.86,null,{"$f":"INDEX(Integrale!$H$3:$H$502,MATCH('NGC024'!D17,Integrale!$H$3:$H$502,1))","v":0.17},{"$f":"INDEX(Integrale!$I$3:$I$502,MATCH('NGC024'!D17,Integrale!$H$3:$H$502,1))","v":0.001531222},{"$f":"INDEX(Integrale!$H$3:$H$502,MATCH('NGC024'!D17,Integrale!$H$3:$H$502,1)+1)","v":0.18},{"$f":"INDEX(Integrale!$I$3:$I$502,MATCH('NGC024'!D17,Integrale!$H$3:$H$502,1)+1)","v":1.8024255E-3},0.2558459422283365,0.7441540577716635]
[2.7,64.4,1.4,0.22283356258596976,0.003286004748143054,1675658373.500048,51.66429779008997,19.78,null,{"$f":"INDEX(Integrale!$H$3:$H$502,MATCH('NGC024'!D18,Integrale!$H$3:$H$502,1))","v":0.22},{"$f":"INDEX(Integrale!$I$3:$I$502,MATCH('NGC024'!D18,Integrale!$H$3:$H$502,1))","v":0.0031686489},{"$f":"INDEX(Integrale!$H$3:$H$502,MATCH('NGC024'!D18,Integrale!$H$3:$H$502,1)+1)","v":0.23},{"$f":"INDEX(Integrale!$I$3:$I$502,MATCH('NGC024'!D18,Integrale!$H$3:$H$502,1)+1)","v":0.0035828125},0.7166437414030246,0.2833562585969754]
[3.22,67.4,2.3,0.2657496561210454,0.005308271172489682,2706888675.075043,60.129408846838544,10.79,null,{"$f":"INDEX(Integrale!$H$3:$H$502,MATCH('NGC024'!D19,Integrale!$H$3:$H$502,1))","v":0.26},{"$f":"INDEX(Integrale!$I$3:$I$502,MATCH('NGC024'!D19,Integrale!$H$3:$H$502,1))","v":0.0050024204},{"$f":"INDEX(Integrale!$H$3:$H$502,MATCH('NGC024'!D19,Integrale!$H$3:$H$502,1)+1)","v":0.27},{"$f":"INDEX(Integrale!$I$3:$I$502,MATCH('NGC024'!D19,Integrale!$H$3:$H$502,1)+1)","v":5.5343666E-3},0.4250343878954617,0.5749656121045382]
[3.77,69.8,0.7,0.3111416781292985,0.008023416407565338,4091444145.055518,68.31991395508375,2.12,null,{"$f":"INDEX(Integrale!$H$3:$H$502,MATCH('NGC024'!D20,Integrale!$H$3:$H$502,1))","v":0.31},{"$f":"INDEX(Integrale!$I$3:$I$502,MATCH('NGC024'!D20,Integrale!$H$3:$H$502,1))","v":0.0079467677},{"$f":"INDEX(Integrale!$H$3:$H$502,MATCH('NGC024'!D20,Integrale!$H$3:$H$502,1)+1)","v":0.32},{"$f":"INDEX(Integrale!$I$3:$I$502,MATCH('NGC024'!D20,Integrale!$H$3:$H$502,1)+1)","v":0.0086181365},0.8858321870701505,0.11416781292984947]
[4.31,71.3,1.1,0.3557083906464924,0.011222434654195323,5722744804.305696,75.56892204371326,5.99,null,{"$f":"INDEX(Integrale!$H$3:$H$502,MATCH('NGC024'!D21,Integrale!$H$3:$H$502,1))","v":0.35},{"$f":"INDEX(Integrale!$I$3:$I$502,MATCH('NGC024'!D21,Integrale!$H$3:$H$502,1))","v":0.0107834863},{"$f":"INDEX(Integrale!$H$3:$H$502,MATCH('NGC024'!D21,Integrale!$H$3:$H$502,1)+1)","v":0.36},{"$f":"INDEX(Integrale!$I$3:$I$502,MATCH('NGC024'!D21,Integrale!$H$3:$H$502,1)+1)","v":0.0115524392},0.4291609353507582,0.5708390646492417]
[4.85,73.2,1.7,0.40027510316368636,0.01485794442902338,7576629038.518829,81.9684674495879,11.98,null,{"$f":"INDEX(Integrale!$H$3:$H$502,MATCH('NGC024'!D22,Integrale!$H$3:$H$502,1))","v":0.4},{"$f":"INDEX(Integrale!$I$3:$I$502,MATCH('NGC024'!D22,Integrale!$H$3:$H$502,1))","v":0.0148341297},{"$f":"INDEX(Integrale!$H$3:$H$502,MATCH('NGC024'!D22,Integrale!$H$3:$H$502,1)+1)","v":0.41},{"$f":"INDEX(Integrale!$I$3:$I$502,MATCH('NGC024'!D22,Integrale!$H$3:$H$502,1)+1)","v":0.0156997951},0.9724896836313658,0.02751031636863423]
[5.38,75.1,3,0.44401650618982114,0.01875327346313617,9563004961.206568,87.43508270308983,16.42,null,{"$f":"INDEX(Integrale!$H$3:$H$502,MATCH('NGC024'!D23,Integrale!$H$3:$H$502,1))","v":0.44},{"$f":"INDEX(Integrale!$I$3:$I$502,MATCH('NGC024'!D23,Integrale!$H$3:$H$502,1))","v":0.0183840679},{"$f":"INDEX(Integrale!$H$3:$H$502,MATCH('NGC024'!D23,Integrale!$H$3:$H$502,1)+1)","v":0.45},{"$f":"INDEX(Integrale!$I$3:$I$502,MATCH('NGC024'!D23,Integrale!$H$3:$H$502,1)+1)","v":0.0193032886},0.5983493810178869,0.4016506189821131]
[5.92,78.5,3.8,0.4885832187070151,0.022930265752957354,11693011654.11817,92.168391925511,17.41,null,{"$f":"INDEX(Integrale!$H$3:$H$502,MATCH('NGC024'!D24,Integrale!$H$3:$H$502,1))","v":0.48},{"$f":"INDEX(Integrale!$I$3:$I$502,MATCH('NGC024'!D24,Integrale!$H$3:$H$502,1))","v":0.0221146072},{"$f":"INDEX(Integrale!$H$3:$H$502,MATCH('NGC024'!D24,Integrale!$H$3:$H$502,1)+1)","v":0.49},{"$f":"INDEX(Integrale!$I$3:$I$502,MATCH('NGC024'!D24,Integrale!$H$3:$H$502,1)+1)","v":0.0230649017},0.14167812929848908,0.8583218707015109]
[6.46,81.4,5,0.5331499312242091,0.02719705890275103,13868811209.333286,96.0910704915273,18.05,null,{"$f":"INDEX(Integrale!$H$3:$H$502,MATCH('NGC024'!D25,Integrale!$H$3:$H$502,1))","v":0.53},{"$f":"INDEX(Integrale!$I$3:$I$502,MATCH('NGC024'!D25,Integrale!$H$3:$H$502,1))","v":0.0268952255},{"$f":"INDEX(Integrale!$H$3:$H$502,MATCH('NGC024'!D25,Integrale!$H$3:$H$502,1)+1)","v":0.54},{"$f":"INDEX(Integrale!$I$3:$I$502,MATCH('NGC024'!D25,Integrale!$H$3:$H$502,1)+1)","v":0.0278534477},0.6850068775790968,0.3149931224209032]
[6.99,83.5,7,0.5768913342503439,{"$f":"N26*K26+O26*M26","v":0.031358689522558464},15990984404.437548,99.19246535100302,18.79,null,{"$f":"INDEX(Integrale!$H$3:$H$502,MATCH('NGC024'!D26,Integrale!$H$3:$H$502,1))","v":0.57},{"$f":"INDEX(Integrale!$I$3:$I$502,MATCH('NGC024'!D26,Integrale!$H$3:$H$502,1))","v":0.0307095554},{"$f":"INDEX(Integrale!$H$3:$H$502,MATCH('NGC024'!D26,Integrale!$H$3:$H$502,1)+1)","v":0.58},{"$f":"INDEX(Integrale!$I$3:$I$502,MATCH('NGC024'!D26,Integrale!$H$3:$H$502,1)+1)","v":0.0316515125},0.3108665749656067,0.6891334250343932]
[7.53,87.1,7.2,{"$f":"A27/$C$12","v":0.6214580467675378},{"$f":"N27*K27+O27*M27","v":0.03547147849669876},{"$f":"4*$H$12*$E$12*POWER($C$12,3)*E27","v":18088251393.12689},{"$f":"POWER($I$8*F27/A27,0.5)","v":101.64370264022395},{"$f":"ROUND(ABS((B27-G27)/B27)*100,2)","v":16.7},null,{"$f":"INDEX(Integrale!$H$3:$H$502,MATCH('NGC024'!D27,Integrale!$H$3:$H$502,1))","v":0.62},{"$f":"INDEX(Integrale!$I$3:$I$502,MATCH('NGC024'!D27,Integrale!$H$3:$H$502,1))","v":0.0353405729},{"$f":"INDEX(Integrale!$H$3:$H$502,MATCH('NGC024'!D27,Integrale!$H$3:$H$502,1)+1)","v":0.63},{"$f":"INDEX(Integrale!$I$3:$I$502,MATCH('NGC024'!D27,Integrale!$H$3:$H$502,1)+1)","v":0.0362383877},{"$f":"(L27-D27)/(L27-J27)","v":0.8541953232462199},{"$f":"(D27-J27)/(L27-J27)","v":0.14580467675378003}]
[8.07,90.7,4.8,0.6660247592847318,0.03937039082503439,20076454573.35971,103.43950064770081,14.05,null,{"$f":"INDEX(Integrale!$H$3:$H$502,MATCH('NGC024'!D28,Integrale!$H$3:$H$502,1))","v":0.66},{"$f":"INDEX(Integrale!$I$3:$I$502,MATCH('NGC024'!D28,Integrale!$H$3:$H$502,1))","v":0.0388598276},{"$f":"INDEX(Integrale!$H$3:$H$502,MATCH('NGC024'!D28,Integrale!$H$3:$H$502,1)+1)","v":0.67},{"$f":"INDEX(Integrale!$I$3:$I$502,MATCH('NGC024'!D28,Integrale!$H$3:$H$502,1)+1)","v":0.0397072693},0.3975240715268221,0.6024759284731779]
[8.62,93.1,1.4,0.7114167812929848,0.04305874134786795,21957284307.851704,104.6683437826996,12.43,null,{"$f":"INDEX(Integrale!$H$3:$H$502,MATCH('NGC024'!D29,Integrale!$H$3:$H$502,1))","v":0.71},{"$f":"INDEX(Integrale!$I$3:$I$502,MATCH('NGC024'!D29,Integrale!$H$3:$H$502,1))","v":0.0429494641},{"$f":"INDEX(Integrale!$H$3:$H$502,MATCH('NGC024'!D29,Integrale!$H$3:$H$502,1)+1)","v":0.72},{"$f":"INDEX(Integrale!$I$3:$I$502,MATCH('NGC024'!D29,Integrale!$H$3:$H$502,1)+1)","v":0.0437207705},0.8583218707015164,0.14167812929848353]
[9.14,95.9,2.1,0.7543328748280606,0.04623981438225585,23579434023.185966,105.3351366140735,9.84,null,{"$f":"INDEX(Integrale!$H$3:$H$502,MATCH('NGC024'!D30,Integrale!$H$3:$H$502,1))","v":0.75},{"$f":"INDEX(Integrale!$I$3:$I$502,MATCH('NGC024'!D30,Integrale!$H$3:$H$502,1))","v":0.0459348212},{"$f":"INDEX(Integrale!$H$3:$H$502,MATCH('NGC024'!D30,Integrale!$H$3:$H$502,1)+1)","v":0.76},{"$f":"INDEX(Integrale!$I$3:$I$502,MATCH('NGC024'!D30,Integrale!$H$3:$H$502,1)+1)","v":0.0466387261},0.5667125171939452,0.4332874828060547]
[9.69,98.4,5.2,0.7997248968363135,0.04926242366354883,25120777064.421597,105.59280301782447,7.31,null,{"$f":"INDEX(Integrale!$H$3:$H$502,MATCH('NGC024'!D31,Integrale!$H$3:$H$502,1))","v":0.79},{"$f":"INDEX(Integrale!$I$3:$I$502,MATCH('NGC024'!D31,Integrale!$H$3:$H$502,1))","v":0.0486459007},{"$f":"INDEX(Integrale!$H$3:$H$502,MATCH('NGC024'!D31,Integrale!$H$3:$H$502,1)+1)","v":0.8},{"$f":"INDEX(Integrale!$I$3:$I$502,MATCH('NGC024'!D31,Integrale!$H$3:$H$502,1)+1)","v":0.0492798642},0.02751031636865073,0.9724896836313492]
[10.23,101,8.2,0.8442916093535076,0.05187513380715268,26453096998.57031,105.45814255892988,4.41,null,{"$f":"INDEX(Integrale!$H$3:$H$502,MATCH('NGC024'!D32,Integrale!$H$3:$H$502,1))","v":0.84},{"$f":"INDEX(Integrale!$I$3:$I$502,MATCH('NGC024'!D32,Integrale!$H$3:$H$502,1))","v":0.0516404838},{"$f":"INDEX(Integrale!$H$3:$H$502,MATCH('NGC024'!D32,Integrale!$H$3:$H$502,1)+1)","v":0.85},{"$f":"INDEX(Integrale!$I$3:$I$502,MATCH('NGC024'!D32,Integrale!$H$3:$H$502,1)+1)","v":0.0521872484},0.5708390646492417,0.4291609353507582]
[10.76,103,9.4,0.8880330123796423,0.054111028553920214,27593264479.09602,105.02074109102007,1.96,null,{"$f":"INDEX(Integrale!$H$3:$H$502,MATCH('NGC024'!D33,Integrale!$H$3:$H$502,1))","v":0.88},{"$f":"INDEX(Integrale!$I$3:$I$502,MATCH('NGC024'!D33,Integrale!$H$3:$H$502,1))","v":0.0537257701},{"$f":"INDEX(Integrale!$H$3:$H$502,MATCH('NGC024'!D33,Integrale!$H$3:$H$502,1)+1)","v":0.89},{"$f":"INDEX(Integrale!$I$3:$I$502,MATCH('NGC024'!D33,Integrale!$H$3:$H$502,1)+1)","v":0.0542053641},0.1966987620357739,0.8033012379642261]
[11.3,104,9.4,0.9325997248968363,0.05606841632077029,28591410694.058853,104.31775752842414,0.31,null,{"$f":"INDEX(Integrale!$H$3:$H$502,MATCH('NGC024'!D34,Integrale!$H$3:$H$502,1))","v":0.93},{"$f":"INDEX(Integrale!$I$3:$I$502,MATCH('NGC024'!D34,Integrale!$H$3:$H$502,1))","v":0.0559641145},{"$f":"INDEX(Integrale!$H$3:$H$502,MATCH('NGC024'!D34,Integrale!$H$3:$H$502,1)+1)","v":0.94},{"$f":"INDEX(Integrale!$I$3:$I$502,MATCH('NGC024'!D34,Integrale!$H$3:$H$502,1)+1)","v":0.0563653178},0.7400275103163731,0.25997248968362685]
[11.84,105,8.9,0.9771664374140302,0.05772813357881705,29437763433.707275,103.40849720040377,1.52,null,{"$f":"INDEX(Integrale!$H$3:$H$502,MATCH('NGC024'!D35,Integrale!$H$3:$H$502,1))","v":0.97},{"$f":"INDEX(Integrale!$I$3:$I$502,MATCH('NGC024'!D35,Integrale!$H$3:$H$502,1))","v":0.0574815594},{"$f":"INDEX(Integrale!$H$3:$H$502,MATCH('NGC024'!D35,Integrale!$H$3:$H$502,1)+1)","v":0.98},{"$f":"INDEX(Integrale!$I$3:$I$502,MATCH('NGC024'!D35,Integrale!$H$3:$H$502,1)+1)","v":0.0578256274},0.28335625859697816,0.7166437414030218]
[12.38,105,8.4,1.0217331499312243,0.059119664678404404,30147357885.85375,102.33966202882213,2.53,null,{"$f":"INDEX(Integrale!$H$3:$H$502,MATCH('NGC024'!D36,Integrale!$H$3:$H$502,1))","v":1.02},{"$f":"INDEX(Integrale!$I$3:$I$502,MATCH('NGC024'!D36,Integrale!$H$3:$H$502,1))","v":0.059071064},{"$f":"INDEX(Integrale!$H$3:$H$502,MATCH('NGC024'!D36,Integrale!$H$3:$H$502,1)+1)","v":1.03},{"$f":"INDEX(Integrale!$I$3:$I$502,MATCH('NGC024'!D36,Integrale!$H$3:$H$502,1)+1)","v":0.0593514822},0.8266850068775692,0.17331499312243076]
[12.91,105,9,1.065474552957359,0.06025330115006877,30725442092.00802,101.17323146364394,3.64,null,{"$f":"INDEX(Integrale!$H$3:$H$502,MATCH('NGC024'!D37,Integrale!$H$3:$H$502,1))","v":1.06},{"$f":"INDEX(Integrale!$I$3:$I$502,MATCH('NGC024'!D37,Integrale!$H$3:$H$502,1))","v":0.0601241663},{"$f":"INDEX(Integrale!$H$3:$H$502,MATCH('NGC024'!D37,Integrale!$H$3:$H$502,1)+1)","v":1.07},{"$f":"INDEX(Integrale!$I$3:$I$502,MATCH('NGC024'!D37,Integrale!$H$3:$H$502,1)+1)","v":0.0603600483},0.45254470426410137,0.5474552957358987]
[13.48,106,8.4,1.1125171939477303,0.061251743805914714,31234585847.10251,99.8280533103306,5.82,null,{"$f":"INDEX(Integrale!$H$3:$H$502,MATCH('NGC024'!D38,Integrale!$H$3:$H$502,1))","v":1.11},{"$f":"INDEX(Integrale!$I$3:$I$502,MATCH('NGC024'!D38,Integrale!$H$3:$H$502,1))","v":0.0612044228},{"$f":"INDEX(Integrale!$H$3:$H$502,MATCH('NGC024'!D38,Integrale!$H$3:$H$502,1)+1)","v":1.12},{"$f":"INDEX(Integrale!$I$3:$I$502,MATCH('NGC024'!D38,Integrale!$H$3:$H$502,1)+1)","v":0.0613924139},0.7482806052269801,0.25171939477301986]
[14.01,108,7.7,1.1562585969738652,0.06200348364786795,31617926486.39233,98.52065658225865,8.78,null,{"$f":"INDEX(Integrale!$H$3:$H$502,MATCH('NGC024'!D39,Integrale!$H$3:$H$502,1))","v":1.15},{"$f":"INDEX(Integrale!$I$3:$I$502,MATCH('NGC024'!D39,Integrale!$H$3:$H$502,1))","v":0.0619061425},{"$f":"INDEX(Integrale!$H$3:$H$502,MATCH('NGC024'!D39,Integrale!$H$3:$H$502,1)+1)","v":1.16},{"$f":"INDEX(Integrale!$I$3:$I$502,MATCH('NGC024'!D39,Integrale!$H$3:$H$502,1)+1)","v":0.0620616744},0.37414030261346787,0.6258596973865321]
[14.54,107,9.2,1.2,0.0626131314,31928808983.236813,97.18267040738559,9.18,null,{"$f":"INDEX(Integrale!$H$3:$H$502,MATCH('NGC024'!D40,Integrale!$H$3:$H$502,1))","v":1.2},{"$f":"INDEX(Integrale!$I$3:$I$502,MATCH('NGC024'!D40,Integrale!$H$3:$H$502,1))","v":0.0626131314},{"$f":"INDEX(Integrale!$H$3:$H$502,MATCH('NGC024'!D40,Integrale!$H$3:$H$502,1)+1)","v":1.21},{"$f":"INDEX(Integrale!$I$3:$I$502,MATCH('NGC024'!D40,Integrale!$H$3:$H$502,1)+1)","v":0.0627347243},1,0]
[{"$nulls":6},"Erreur moy",{"$f":"ROUND(AVERAGE(H15:H40),2)","v":12.21}]
[null,"Précision=",{"$f":"ROUND(MAX(0,100-H41),2)","v":87.79},"%"]
[]
["R","V_Obs","Incer V_Obs","V_TURI","A=(V_obs-V_TURI)^2","A/Incer V_Obs^2"]
[{"$f":"A15","v":1.08},{"$f":"B15","v":34.6},{"$f":"C15","v":0.9},{"$f":"ROUND(G15,2)","v":21.78},{"$f":"ROUND(POWER((B45-D45),2),2)","v":164.35},{"$f":"ROUND(E45/POWER(C45,2),2)","v":202.9}]
[{"$f":"A16","v":1.61},{"$f":"B16","v":47},0.8,{"$f":"ROUND(G16,2)","v":32.05},{"$f":"ROUND(POWER((B46-D46),2),2)","v":223.5},{"$f":"ROUND(E46/POWER(C46,2),2)","v":349.22}]
[2.15,{"$f":"B17","v":59.1},3.1,42.05,290.7,30.25]
[2.7,{"$f":"B18","v":64.4},1.4,51.66,162.31,82.81]
[3.22,{"$f":"B19","v":67.4},2.3,60.13,52.85,9.99]
[3.77,{"$f":"B20","v":69.8},0.7,68.32,2.19,4.47]
[4.31,{"$f":"B21","v":71.3},1.1,75.57,18.23,15.07]
[4.85,{"$f":"B22","v":73.2},1.7,81.97,76.91,26.61]
[5.38,{"$f":"B23","v":75.1},3,87.44,152.28,16.92]
[5.92,{"$f":"B24","v":78.5},3.8,92.17,186.87,12.94]
[6.46,{"$f":"B25","v":81.4},5,96.09,215.8,8.63]
[6.99,{"$f":"B26","v":83.5},7,99.19,246.18,5.02]
[7.53,87.1,7.2,101.64,211.41,4.08]
[8.07,90.7,4.8,103.44,162.31,7.04]
[8.62,93.1,1.4,104.67,133.86,68.3]
[9.14,95.9,2.1,105.34,89.11,20.21]
[9.69,98.4,5.2,105.59,51.7,1.91]
[{"$f":"A32","v":10.23},101,8.2,105.46,19.89,0.3]
[10.76,103,9.4,105.02,4.08,0.05]
[11.3,104,9.4,104.32,0.1,0]
[11.84,105,8.9,103.41,2.53,0.03]
[12.38,105,8.4,102.34,7.08,0.1]
[12.91,105,9,101.17,14.67,0.18]
[13.48,106,8.4,99.83,38.07,0.54]
[14.01,108,7.7,98.52,89.87,1.52]
[{"$f":"A40","v":14.54},107,9.2,97.18,96.43,1.14]
[{"$nulls":4},"X^2/d_f=",{"$f":"ROUND(SUM(F45:F70)/(COUNT(F45:F70)-2),2)","v":36.26}]

{"sheet":"Integrale","index":1,"n_rows":372,"n_cols":9,"rows_kept":372}
[{"$nulls":7},"u","I(u) = Integrale de 0 à u de ( x^2sech^8(x)dx"]
[{"$nulls":7},0,0]
[{"$nulls":7},0.01,4.998e-07]
[{"$nulls":7},0.02,2.9964e-06]
[{"$nulls":7},0.03,9.477e-06]
[{"$nulls":7},0.04,2.19098e-05]
[{"$nulls":7},0.05,4.22345e-05]
[{"$nulls":7},0.06,7.2353e-05]
[{"$nulls":7},0.07,0.0001141207]
[{"$nulls":7},0.08,1.693376E-4]
[{"$nulls":7},0.09,0.0002397401]
[{"$nulls":7},0.1,0.0003269934]
[{"$nulls":7},0.11,0.0004326832]
[{"$nulls":7},0.12,0.0005583096]
[{"$nulls":7},0.13,0.0007052805]
[{"$nulls":7},0.14,0.0008749055]
[{"$nulls":7},0.15,1.0683906E-3]
[{"$nulls":7},0.16,0.001286834]
[{"$nulls":7},0.17,0.001531222]
[{"$nulls":7},0.18,1.8024255E-3]
[{"$nulls":7},0.19,0.0021011974]
[{"$nulls":7},0.2,0.0024281708]
[{"$nulls":7},0.21,0.0027838579]
[{"$nulls":7},0.22,0.0031686489]
[{"$nulls":7},0.23,0.0035828125]
[{"$nulls":7},0.24,0.0040264964]
[{"$nulls":7},0.25,4.4997288E-3]
[{"$nulls":7},0.26,0.0050024204]
[{"$nulls":7},0.27,5.5343666E-3]
[{"$nulls":7},0.28,0.006095251]
[{"$nulls":7},0.29,0.0066846487]
[{"$nulls":7},0.3,0.0073020305]
[{"$nulls":7},0.31,0.0079467677]
[{"$nulls":7},0.32,0.0086181365]
[{"$nulls":7},0.33,0.0093153237]
[{"$nulls":7},0.34,0.010037432]
[{"$nulls":7},0.35,0.0107834863]
[{"$nulls":7},0.36,0.0115524392]
[{"$nulls":7},0.37,0.0123431779]
[{"$nulls":7},0.38,0.0131545302]
[{"$nulls":7},0.39,0.0139852712]
[{"$nulls":7},0.4,0.0148341297]
[{"$nulls":7},0.41,0.0156997951]
[{"$nulls":7},0.42,0.0165809236]
[{"$nulls":7},0.43,0.0174761447]
[{"$nulls":7},0.44,0.0183840679]
[{"$nulls":7},0.45,0.0193032886]
[{"$nulls":7},0.46,0.0202323944]
[{"$nulls":7},0.47,0.0211699709]
[{"$nulls":7},0.48,0.0221146072]
[{"$nulls":7},0.49,0.0230649017]
[{"$nulls":7},0.5,0.0240194669]
[{"$nulls":7},0.51,0.0249769344]
[{"$nulls":7},0.52,0.0259359595]
[{"$nulls":7},0.53,0.0268952255]
[{"$nulls":7},0.54,0.0278534477]
[{"$nulls":7},0.55,0.0288093767]
[{"$nulls":7},0.56,0.0297618021]
[{"$nulls":7},0.57,0.0307095554]
[{"$nulls":7},0.58,0.0316515125]
[{"$nulls":7},0.59,0.0325865959]
[{"$nulls":7},0.6,0.0335137772]
[{"$nulls":7},0.61,0.0344320783]
[{"$nulls":7},0.62,0.0353405729]
[{"$nulls":7},0.63,0.0362383877]
[{"$nulls":7},0.64,0.037124703]
[{"$nulls":7},0.65,0.0379987533]
[{"$nulls":7},0.66,0.0388598276]
[{"$nulls":7},0.67,0.0397072693]
[{"$nulls":7},0.68,0.040540476]
[{"$nulls":7},0.69,0.0413588991]
[{"$nulls":7},0.7,0.0421620429]
[{"$nulls":7},0.71,0.0429494641]
[{"$nulls":7},0.72,0.0437207705]
[{"$nulls":7},0.73,0.04447562]
[{"$nulls":7},0.74,0.0452137189]
[{"$nulls":7},0.75,0.0459348212]
[{"$nulls":7},0.76,0.0466387261]
[{"$nulls":7},0.77,0.0473252771]
[{"$nulls":7},0.78,0.0479943599]
[{"$nulls":7},0.79,0.0486459007]
[{"$nulls":7},0.8,0.0492798642]
[{"$nulls":7},0.81,0.0498962518]
[{"$nulls":7},0.82,0.0504950998]
[{"$nulls":7},0.83,0.0510764772]
[{"$nulls":7},0.84,0.0516404838]
[{"$nulls":7},0.85,0.0521872484]
[{"$nulls":7},0.86,0.0527169267]
[{"$nulls":7},0.87,0.0532296993]
[{"$nulls":7},0.88,0.0537257701]
[{"$nulls":7},0.89,0.0542053641]
[{"$nulls":7},0.9,0.0546687257]
[{"$nulls":7},0.91,0.0551161169]
[{"$nulls":7},0.92,0.0555478158]
[{"$nulls":7},0.93,0.0559641145]
[{"$nulls":7},0.94,0.0563653178]
[{"$nulls":7},0.95,0.0567517415]
[{"$nulls":7},0.96,0.0571237109]
[{"$nulls":7},0.97,0.0574815594]
[{"$nulls":7},0.98,0.0578256274]
[{"$nulls":7},0.99,0.0581562605]
[{"$nulls":7},1,0.0584738086]
[{"$nulls":7},1.01,0.0587786248]
[{"$nulls":7},1.02,0.059071064]
[{"$nulls":7},1.03,0.0593514822]
[{"$nulls":7},1.04,0.0596202355]
[{"$nulls":7},1.05,0.0598776791]
[{"$nulls":7},1.06,0.0601241663]
[{"$nulls":7},1.07,0.0603600483]
[{"$nulls":7},1.08,0.060585673]
[{"$nulls":7},1.09,0.0608013846]
[{"$nulls":7},1.1,0.0610075229]
[{"$nulls":7},1.11,0.0612044228]
[{"$nulls":7},1.12,0.0613924139]
[{"$nulls":7},1.13,0.0615718202]
[{"$nulls":7},1.14,0.0617429593]
[{"$nulls":7},1.15,0.0619061425]
[{"$nulls":7},1.16,0.0620616744]
[{"$nulls":7},1.17,0.0622098525]
[{"$nulls":7},1.18,0.0623509673]
[{"$nulls":7},1.19,0.0624853017]
[{"$nulls":7},1.2,0.0626131314]
[{"$nulls":7},1.21,0.0627347243]
[{"$nulls":7},1.22,0.0628503409]
[{"$nulls":7},1.23,0.0629602337]
[{"$nulls":7},1.24,0.0630646479]
[{"$nulls":7},1.25,0.0631638207]
[{"$nulls":7},1.26,0.0632579818]
[{"$nulls":7},1.27,0.0633473531]
[{"$nulls":7},1.28,0.0634321492]
[{"$nulls":7},1.29,0.0635125771]
[{"$nulls":7},1.3,0.0635888365]
[{"$nulls":7},1.31,0.0636611197]
[{"$nulls":7},1.32,0.0637296121]
[{"$nulls":7},1.33,0.0637944919]
[{"$nulls":7},1.34,0.0638559305]
[{"$nulls":7},1.35,0.0639140927]
[{"$nulls":7},1.36,0.0639691366]
[{"$nulls":7},1.37,0.064021214]
[{"$nulls":7},1.38,0.0640704704]
[{"$nulls":7},1.39,0.0641170452]
[{"$nulls":7},1.4,0.064161072]
[{"$nulls":7},1.41,0.0642026787]
[{"$nulls":7},1.42,0.0642419876]
[{"$nulls":7},1.43,0.0642791157]
[{"$nulls":7},1.44,0.0643141746]
[{"$nulls":7},1.45,0.064347271]
[{"$nulls":7},1.46,0.064378507]
[{"$nulls":7},1.47,0.0644079795]
[{"$nulls":7},1.48,0.0644357814]
[{"$nulls":7},1.49,0.0644620009]
[{"$nulls":7},1.5,0.0644867222]
[{"$nulls":7},1.51,0.0645100253]
[{"$nulls":7},1.52,0.0645319867]
[{"$nulls":7},1.53,0.0645526787]
[{"$nulls":7},1.54,0.0645721705]
[{"$nulls":7},1.55,0.0645905275]
[{"$nulls":7},1.56,0.0646078121]
[{"$nulls":7},1.57,0.0646240835]
[{"$nulls":7},1.58,0.0646393978]
[{"$nulls":7},1.59,0.0646538084]
[{"$nulls":7},1.6,0.0646673658]
[{"$nulls":7},1.61,0.064680118]
[{"$nulls":7},1.62,0.0646921104]
[{"$nulls":7},1.63,0.0647033862]
[{"$nulls":7},1.64,0.0647139861]
[{"$nulls":7},1.65,0.0647239487]
[{"$nulls":7},1.66,0.0647333107]
[{"$nulls":7},1.67,0.0647421067]
[{"$nulls":7},1.68,0.0647503694]
[{"$nulls":7},1.69,0.0647581297]
[{"$nulls":7},1.7,0.064765417]
[{"$nulls":7},1.71,0.064772259]
[{"$nulls":7},1.72,0.0647786817]
[{"$nulls":7},1.73,0.0647847098]
[{"$nulls":7},1.74,0.0647903667]
[{"$nulls":7},1.75,0.0647956744]
[{"$nulls":7},1.76,0.0648006536]
[{"$nulls":7},1.77,0.064805324]
[{"$nulls":7},1.78,0.0648097041]
[{"$nulls":7},1.79,0.0648138112]
[{"$nulls":7},1.8,0.0648176618]
[{"$nulls":7},1.81,0.0648212714]
[{"$nulls":7},1.82,0.0648246547]
[{"$nulls":7},1.83,0.0648278252]
[{"$nulls":7},1.84,0.0648307961]
[{"$nulls":7},1.85,0.0648335795]
[{"$nulls":7},1.86,0.0648361869]
[{"$nulls":7},1.87,0.0648386291]
[{"$nulls":7},1.88,0.0648409162]
[{"$nulls":7},1.89,0.0648430578]
[{"$nulls":7},1.9,0.064845063]
[{"$nulls":7},1.91,0.0648469402]
[{"$nulls":7},1.92,0.0648486973]
[{"$nulls":7},1.93,0.0648503418]
[{"$nulls":7},1.94,0.0648518808]
[{"$nulls":7},1.95,0.0648533208]
[{"$nulls":7},1.96,0.0648546681]
[{"$nulls":7},1.97,0.0648559285]
[{"$nulls":7},1.98,0.0648571074]
{"$rows_left_out":173}
{"sheet":"Feuil3","index":2,"n_rows":0,"n_cols":0,"rows_kept":0}