{"text_format":"3","workbook":"xlsx","n_sheets":3,"sheets":["UGCA444","Integrale","Feuil3"],"not_rendered":{"charts":1},"read":"whole","date_system":"1900"}

{"sheet":"UGCA444","index":0,"n_rows":91,"n_cols":15,"rows_kept":91,"merged":[[9,2,9,3],[13,9,13,14]]}
[]
[]
[null,"ρ(r) = ρ0sech^8( r/ r_c)"]
[]
[]
["M(R) =4πρ0,r_c^3 ·I(u)",null,"u = R/r_c","I(u) = Integrale de 0 à u de ( x^2sech^8(x)dx",{"$nulls":3},"V_TURI(R) = Racine (G·M(R)/R)"]
[]
[{"$nulls":7},"G=",{"$f":"4.3009*POWER(10,-6)","v":4.3009000000000006E-6},"10^-6,KPC,(Km/s)^2/Mo"]
["UGCA444","R_max=",{"$f":"A50","v":2.62},"V_obs(R_max)=",{"$f":"B50","v":38.3}]
[null,"M_totale=","V_obs^2(R_max).R_max/G=",null,{"$f":"E9*E9*C9/I8","v":893592457.3926386},"Mo","I(infini)=",0.0648738184]
[{"$nulls":6},"M(R) = racine(G,M(R)/R)"]
[null,"r_c=R_max=",{"$f":"C9","v":2.62},"ρ0=M_tot/4.π.r_c^3.I(infini)=",{"$f":"E10/(POWER(C12,3)*4*3.14159*H10)","v":60947607.55343568},"Mo/kpc^3","π=",3.14159]
[]
["R","V_obs","Incer V_obs","u=R/r-c","I(U) par table","M(R) ","V_TURI","Erreur %",null,"calculs intermediaires de I(u)"]
[0.12,6.48,2.6,{"$f":"A15/$C$12","v":0.045801526717557245},{"$f":"N15*K15+O15*M15","v":3.3701229007633571E-5},{"$f":"4*$H$12*$E$12*POWER($C$12,3)*E15","v":464211.3689130923},{"$f":"POWER($I$8*F15/A15,0.5)","v":4.078936418314541},{"$f":"ROUND(ABS((B15-G15)/B15)*100,2)","v":37.05},null,{"$f":"INDEX(Integrale!$H$3:$H$502,MATCH(UGCA444!D15,Integrale!$H$3:$H$502,1))","v":0.04},{"$f":"INDEX(Integrale!$I$3:$I$502,MATCH(UGCA444!D15,Integrale!$H$3:$H$502,1))","v":2.19098e-05},{"$f":"INDEX(Integrale!$H$3:$H$502,MATCH(UGCA444!D15,Integrale!$H$3:$H$502,1)+1)","v":0.05},{"$f":"INDEX(Integrale!$I$3:$I$502,MATCH(UGCA444!D15,Integrale!$H$3:$H$502,1)+1)","v":4.22345e-05},{"$f":"(L15-D15)/(L15-J15)","v":0.41984732824427573},{"$f":"(D15-J15)/(L15-J15)","v":0.5801526717557243}]
[0.19,8.6,2.65,{"$f":"A16/$C$12","v":0.07251908396946564},{"$f":"N16*K16+O16*M16","v":1.2803030076335872E-4},{"$f":"4*$H$12*$E$12*POWER($C$12,3)*E16","v":1763529.785998358},{"$f":"POWER($I$8*F16/A16,0.5)","v":6.318213128725699},{"$f":"ROUND(ABS((B16-G16)/B16)*100,2)","v":26.53},null,{"$f":"INDEX(Integrale!$H$3:$H$502,MATCH(UGCA444!D16,Integrale!$H$3:$H$502,1))","v":0.07},{"$f":"INDEX(Integrale!$I$3:$I$502,MATCH(UGCA444!D16,Integrale!$H$3:$H$502,1))","v":0.0001141207},{"$f":"INDEX(Integrale!$H$3:$H$502,MATCH(UGCA444!D16,Integrale!$H$3:$H$502,1)+1)","v":0.08},{"$f":"INDEX(Integrale!$I$3:$I$502,MATCH(UGCA444!D16,Integrale!$H$3:$H$502,1)+1)","v":1.693376E-4},{"$f":"(L16-D16)/(L16-J16)","v":0.748091603053436},{"$f":"(D16-J16)/(L16-J16)","v":0.2519083969465639}]
[0.26,10.2,3.03,0.09923664122137404,3.2033284274809158E-4,4412365.715393697,8.543360828812933,16.24,null,{"$f":"INDEX(Integrale!$H$3:$H$502,MATCH(UGCA444!D17,Integrale!$H$3:$H$502,1))","v":0.09},{"$f":"INDEX(Integrale!$I$3:$I$502,MATCH(UGCA444!D17,Integrale!$H$3:$H$502,1))","v":0.0002397401},{"$f":"INDEX(Integrale!$H$3:$H$502,MATCH(UGCA444!D17,Integrale!$H$3:$H$502,1)+1)","v":0.1},{"$f":"INDEX(Integrale!$I$3:$I$502,MATCH(UGCA444!D17,Integrale!$H$3:$H$502,1)+1)","v":0.0003269934},0.07633587786259603,0.923664122137404]
[0.33,11.7,3.55,0.12595419847328243,6.4581899083969452E-4,8895714.685653165,10.767456480767843,7.97,null,{"$f":"INDEX(Integrale!$H$3:$H$502,MATCH(UGCA444!D18,Integrale!$H$3:$H$502,1))","v":0.12},{"$f":"INDEX(Integrale!$I$3:$I$502,MATCH(UGCA444!D18,Integrale!$H$3:$H$502,1))","v":0.0005583096},{"$f":"INDEX(Integrale!$H$3:$H$502,MATCH(UGCA444!D18,Integrale!$H$3:$H$502,1)+1)","v":0.13},{"$f":"INDEX(Integrale!$I$3:$I$502,MATCH(UGCA444!D18,Integrale!$H$3:$H$502,1)+1)","v":0.0007052805},0.40458015267175707,0.5954198473282429]
[0.4,12.7,3.75,0.15267175572519084,1.1267533404580154E-3,15520256.263738628,12.91811423590083,1.72,null,{"$f":"INDEX(Integrale!$H$3:$H$502,MATCH(UGCA444!D19,Integrale!$H$3:$H$502,1))","v":0.15},{"$f":"INDEX(Integrale!$I$3:$I$502,MATCH(UGCA444!D19,Integrale!$H$3:$H$502,1))","v":1.0683906E-3},{"$f":"INDEX(Integrale!$H$3:$H$502,MATCH(UGCA444!D19,Integrale!$H$3:$H$502,1)+1)","v":0.16},{"$f":"INDEX(Integrale!$I$3:$I$502,MATCH(UGCA444!D19,Integrale!$H$3:$H$502,1)+1)","v":0.001286834},0.7328244274809153,0.26717557251908475]
[0.47,14.1,3.43,0.17938931297709923,1.7858634541984735E-3,24599047.0726619,15.003406815589159,6.41,null,{"$f":"INDEX(Integrale!$H$3:$H$502,MATCH(UGCA444!D20,Integrale!$H$3:$H$502,1))","v":0.17},{"$f":"INDEX(Integrale!$I$3:$I$502,MATCH(UGCA444!D20,Integrale!$H$3:$H$502,1))","v":0.001531222},{"$f":"INDEX(Integrale!$H$3:$H$502,MATCH(UGCA444!D20,Integrale!$H$3:$H$502,1)+1)","v":0.18},{"$f":"INDEX(Integrale!$I$3:$I$502,MATCH(UGCA444!D20,Integrale!$H$3:$H$502,1)+1)","v":1.8024255E-3},0.061068702290076445,0.9389312977099236]
[0.55,16,3.33,0.20992366412213742,0.002781142731297711,38308338.07710625,17.307924156599288,8.17,null,{"$f":"INDEX(Integrale!$H$3:$H$502,MATCH(UGCA444!D21,Integrale!$H$3:$H$502,1))","v":0.2},{"$f":"INDEX(Integrale!$I$3:$I$502,MATCH(UGCA444!D21,Integrale!$H$3:$H$502,1))","v":0.0024281708},{"$f":"INDEX(Integrale!$H$3:$H$502,MATCH(UGCA444!D21,Integrale!$H$3:$H$502,1)+1)","v":0.21},{"$f":"INDEX(Integrale!$I$3:$I$502,MATCH(UGCA444!D21,Integrale!$H$3:$H$502,1)+1)","v":0.0027838579},7.633587786257127E-3,0.9923664122137429]
[0.62,18.1,2.66,0.23664122137404578,3.8774727999999993E-3,53409534.59007608,19.248337478206597,6.34,null,{"$f":"INDEX(Integrale!$H$3:$H$502,MATCH(UGCA444!D22,Integrale!$H$3:$H$502,1))","v":0.23},{"$f":"INDEX(Integrale!$I$3:$I$502,MATCH(UGCA444!D22,Integrale!$H$3:$H$502,1))","v":0.0035828125},{"$f":"INDEX(Integrale!$H$3:$H$502,MATCH(UGCA444!D22,Integrale!$H$3:$H$502,1)+1)","v":0.24},{"$f":"INDEX(Integrale!$I$3:$I$502,MATCH(UGCA444!D22,Integrale!$H$3:$H$502,1)+1)","v":0.0040264964},0.3358778625954218,0.6641221374045782]
[0.69,21.2,3.78,0.2633587786259542,5.1810893526717545E-3,71365960.5802514,21.09117061846962,0.51,null,{"$f":"INDEX(Integrale!$H$3:$H$502,MATCH(UGCA444!D23,Integrale!$H$3:$H$502,1))","v":0.26},{"$f":"INDEX(Integrale!$I$3:$I$502,MATCH(UGCA444!D23,Integrale!$H$3:$H$502,1))","v":0.0050024204},{"$f":"INDEX(Integrale!$H$3:$H$502,MATCH(UGCA444!D23,Integrale!$H$3:$H$502,1)+1)","v":0.27},{"$f":"INDEX(Integrale!$I$3:$I$502,MATCH(UGCA444!D23,Integrale!$H$3:$H$502,1)+1)","v":5.5343666E-3},0.6641221374045819,0.33587786259541813]
[0.76,21.6,3.33,0.2900763358778626,6.6893615381679395E-3,92141377.87331614,22.834958543960656,5.72,null,{"$f":"INDEX(Integrale!$H$3:$H$502,MATCH(UGCA444!D24,Integrale!$H$3:$H$502,1))","v":0.29},{"$f":"INDEX(Integrale!$I$3:$I$502,MATCH(UGCA444!D24,Integrale!$H$3:$H$502,1))","v":0.0066846487},{"$f":"INDEX(Integrale!$H$3:$H$502,MATCH(UGCA444!D24,Integrale!$H$3:$H$502,1)+1)","v":0.3},{"$f":"INDEX(Integrale!$I$3:$I$502,MATCH(UGCA444!D24,Integrale!$H$3:$H$502,1)+1)","v":0.0073020305},0.9923664122137401,0.007633587786259881]
[0.83,23.3,3.09,0.31679389312977096,0.008402888487786257,115744039.09292987,24.490065301579765,5.11,null,{"$f":"INDEX(Integrale!$H$3:$H$502,MATCH(UGCA444!D25,Integrale!$H$3:$H$502,1))","v":0.31},{"$f":"INDEX(Integrale!$I$3:$I$502,MATCH(UGCA444!D25,Integrale!$H$3:$H$502,1))","v":0.0079467677},{"$f":"INDEX(Integrale!$H$3:$H$502,MATCH(UGCA444!D25,Integrale!$H$3:$H$502,1)+1)","v":0.32},{"$f":"INDEX(Integrale!$I$3:$I$502,MATCH(UGCA444!D25,Integrale!$H$3:$H$502,1)+1)","v":0.0086181365},0.3206106870229039,0.6793893129770961]
[0.9,24.5,3.26,0.3435114503816794,0.010299405265648855,141867259.9825547,26.037513502614935,6.28,null,{"$f":"INDEX(Integrale!$H$3:$H$502,MATCH(UGCA444!D26,Integrale!$H$3:$H$502,1))","v":0.34},{"$f":"INDEX(Integrale!$I$3:$I$502,MATCH(UGCA444!D26,Integrale!$H$3:$H$502,1))","v":0.010037432},{"$f":"INDEX(Integrale!$H$3:$H$502,MATCH(UGCA444!D26,Integrale!$H$3:$H$502,1)+1)","v":0.35},{"$f":"INDEX(Integrale!$I$3:$I$502,MATCH(UGCA444!D26,Integrale!$H$3:$H$502,1)+1)","v":0.0107834863},0.6488549618320602,0.3511450381679398]
[0.97,24.4,3.29,0.37022900763358774,0.012361758487022896,170274764.40500528,27.476976946022553,12.61,null,{"$f":"INDEX(Integrale!$H$3:$H$502,MATCH(UGCA444!D27,Integrale!$H$3:$H$502,1))","v":0.37},{"$f":"INDEX(Integrale!$I$3:$I$502,MATCH(UGCA444!D27,Integrale!$H$3:$H$502,1))","v":0.0123431779},{"$f":"INDEX(Integrale!$H$3:$H$502,MATCH(UGCA444!D27,Integrale!$H$3:$H$502,1)+1)","v":0.38},{"$f":"INDEX(Integrale!$I$3:$I$502,MATCH(UGCA444!D27,Integrale!$H$3:$H$502,1)+1)","v":0.0131545302},0.9770992366412259,0.02290076335877409]
[1.04,25.3,2.78,0.3969465648854962,0.014574936264885492,200759773.8886927,28.81385403155583,13.89,null,{"$f":"INDEX(Integrale!$H$3:$H$502,MATCH(UGCA444!D28,Integrale!$H$3:$H$502,1))","v":0.39},{"$f":"INDEX(Integrale!$I$3:$I$502,MATCH(UGCA444!D28,Integrale!$H$3:$H$502,1))","v":0.0139852712},{"$f":"INDEX(Integrale!$H$3:$H$502,MATCH(UGCA444!D28,Integrale!$H$3:$H$502,1)+1)","v":0.4},{"$f":"INDEX(Integrale!$I$3:$I$502,MATCH(UGCA444!D28,Integrale!$H$3:$H$502,1)+1)","v":0.0148341297},0.30534351145038413,0.6946564885496158]
[1.11,25.4,2.78,0.4236641221374046,0.01690894354503817,232909127.0866839,30.040796055465194,18.27,null,{"$f":"INDEX(Integrale!$H$3:$H$502,MATCH(UGCA444!D29,Integrale!$H$3:$H$502,1))","v":0.42},{"$f":"INDEX(Integrale!$I$3:$I$502,MATCH(UGCA444!D29,Integrale!$H$3:$H$502,1))","v":0.0165809236},{"$f":"INDEX(Integrale!$H$3:$H$502,MATCH(UGCA444!D29,Integrale!$H$3:$H$502,1)+1)","v":0.43},{"$f":"INDEX(Integrale!$I$3:$I$502,MATCH(UGCA444!D29,Integrale!$H$3:$H$502,1)+1)","v":0.0174761447},0.6335877862595368,0.3664122137404632]
[1.19,25.9,2.73,0.4541984732824427,0.019693371187786253,271262712.57125974,31.31131028364616,20.89,null,{"$f":"INDEX(Integrale!$H$3:$H$502,MATCH(UGCA444!D30,Integrale!$H$3:$H$502,1))","v":0.45},{"$f":"INDEX(Integrale!$I$3:$I$502,MATCH(UGCA444!D30,Integrale!$H$3:$H$502,1))","v":0.0193032886},{"$f":"INDEX(Integrale!$H$3:$H$502,MATCH(UGCA444!D30,Integrale!$H$3:$H$502,1)+1)","v":0.46},{"$f":"INDEX(Integrale!$I$3:$I$502,MATCH(UGCA444!D30,Integrale!$H$3:$H$502,1)+1)","v":0.0202323944},0.5801526717557287,0.41984732824427123]
[1.26,26.7,2.67,0.4809160305343511,0.022201657077862594,305812634.36770207,32.308895516339675,21.01,null,{"$f":"INDEX(Integrale!$H$3:$H$502,MATCH(UGCA444!D31,Integrale!$H$3:$H$502,1))","v":0.48},{"$f":"INDEX(Integrale!$I$3:$I$502,MATCH(UGCA444!D31,Integrale!$H$3:$H$502,1))","v":0.0221146072},{"$f":"INDEX(Integrale!$H$3:$H$502,MATCH(UGCA444!D31,Integrale!$H$3:$H$502,1)+1)","v":0.49},{"$f":"INDEX(Integrale!$I$3:$I$502,MATCH(UGCA444!D31,Integrale!$H$3:$H$502,1)+1)","v":0.0230649017},0.908396946564887,0.09160305343511302]
[1.33,27.1,3.16,0.5076335877862596,0.024750358121374046,340919247.24792343,33.20317484693649,22.52,null,{"$f":"INDEX(Integrale!$H$3:$H$502,MATCH(UGCA444!D32,Integrale!$H$3:$H$502,1))","v":0.5},{"$f":"INDEX(Integrale!$I$3:$I$502,MATCH(UGCA444!D32,Integrale!$H$3:$H$502,1))","v":0.0240194669},{"$f":"INDEX(Integrale!$H$3:$H$502,MATCH(UGCA444!D32,Integrale!$H$3:$H$502,1)+1)","v":0.51},{"$f":"INDEX(Integrale!$I$3:$I$502,MATCH(UGCA444!D32,Integrale!$H$3:$H$502,1)+1)","v":0.0249769344},0.2366412213740452,0.7633587786259548]
[1.4,28.6,3.34,0.5343511450381678,0.02731216187709922,376206341.0231242,33.996069647895176,18.87,null,{"$f":"INDEX(Integrale!$H$3:$H$502,MATCH(UGCA444!D33,Integrale!$H$3:$H$502,1))","v":0.53},{"$f":"INDEX(Integrale!$I$3:$I$502,MATCH(UGCA444!D33,Integrale!$H$3:$H$502,1))","v":0.0268952255},{"$f":"INDEX(Integrale!$H$3:$H$502,MATCH(UGCA444!D33,Integrale!$H$3:$H$502,1)+1)","v":0.54},{"$f":"INDEX(Integrale!$I$3:$I$502,MATCH(UGCA444!D33,Integrale!$H$3:$H$502,1)+1)","v":0.0278534477},0.56488549618322,0.4351145038167799]
[1.48,28.9,3.21,0.564885496183206,0.030224826612977096,416326304.7170447,34.782896192509284,20.36,null,{"$f":"INDEX(Integrale!$H$3:$H$502,MATCH(UGCA444!D34,Integrale!$H$3:$H$502,1))","v":0.56},{"$f":"INDEX(Integrale!$I$3:$I$502,MATCH(UGCA444!D34,Integrale!$H$3:$H$502,1))","v":0.0297618021},{"$f":"INDEX(Integrale!$H$3:$H$502,MATCH(UGCA444!D34,Integrale!$H$3:$H$502,1)+1)","v":0.57},{"$f":"INDEX(Integrale!$I$3:$I$502,MATCH(UGCA444!D34,Integrale!$H$3:$H$502,1)+1)","v":0.0307095554},0.5114503816793955,0.4885496183206045]
[1.55,30.4,4.14,0.5916030534351145,0.032735228016793905,450905366.267684,35.37174824704107,16.35,null,{"$f":"INDEX(Integrale!$H$3:$H$502,MATCH(UGCA444!D35,Integrale!$H$3:$H$502,1))","v":0.59},{"$f":"INDEX(Integrale!$I$3:$I$502,MATCH(UGCA444!D35,Integrale!$H$3:$H$502,1))","v":0.0325865959},{"$f":"INDEX(Integrale!$H$3:$H$502,MATCH(UGCA444!D35,Integrale!$H$3:$H$502,1)+1)","v":0.6},{"$f":"INDEX(Integrale!$I$3:$I$502,MATCH(UGCA444!D35,Integrale!$H$3:$H$502,1)+1)","v":0.0335137772},0.8396946564885425,0.1603053435114575]
[1.62,30.8,4.35,0.6183206106870229,0.035188001287786264,484690639.7217442,35.871908370069306,16.47,null,{"$f":"INDEX(Integrale!$H$3:$H$502,MATCH(UGCA444!D36,Integrale!$H$3:$H$502,1))","v":0.61},{"$f":"INDEX(Integrale!$I$3:$I$502,MATCH(UGCA444!D36,Integrale!$H$3:$H$502,1))","v":0.0344320783},{"$f":"INDEX(Integrale!$H$3:$H$502,MATCH(UGCA444!D36,Integrale!$H$3:$H$502,1)+1)","v":0.62},{"$f":"INDEX(Integrale!$I$3:$I$502,MATCH(UGCA444!D36,Integrale!$H$3:$H$502,1)+1)","v":0.0353405729},0.1679389312977063,0.8320610687022937]
[1.69,30.5,4.56,0.6450381679389312,0.037565064219847316,517433055.06317544,36.28803107258614,18.98,null,{"$f":"INDEX(Integrale!$H$3:$H$502,MATCH(UGCA444!D37,Integrale!$H$3:$H$502,1))","v":0.64},{"$f":"INDEX(Integrale!$I$3:$I$502,MATCH(UGCA444!D37,Integrale!$H$3:$H$502,1))","v":0.037124703},{"$f":"INDEX(Integrale!$H$3:$H$502,MATCH(UGCA444!D37,Integrale!$H$3:$H$502,1)+1)","v":0.65},{"$f":"INDEX(Integrale!$I$3:$I$502,MATCH(UGCA444!D37,Integrale!$H$3:$H$502,1)+1)","v":0.0379987533},0.49618320610688116,0.5038167938931188]
[1.75,33,4.04,0.6679389312977099,0.039532605743511445,544534593.2262672,36.582500359807895,10.86,null,{"$f":"INDEX(Integrale!$H$3:$H$502,MATCH(UGCA444!D38,Integrale!$H$3:$H$502,1))","v":0.66},{"$f":"INDEX(Integrale!$I$3:$I$502,MATCH(UGCA444!D38,Integrale!$H$3:$H$502,1))","v":0.0388598276},{"$f":"INDEX(Integrale!$H$3:$H$502,MATCH(UGCA444!D38,Integrale!$H$3:$H$502,1)+1)","v":0.67},{"$f":"INDEX(Integrale!$I$3:$I$502,MATCH(UGCA444!D38,Integrale!$H$3:$H$502,1)+1)","v":0.0397072693},0.20610687022901678,0.7938931297709833]
[1.83,32.1,4.35,0.6984732824427481,0.0420394255259542,579064320.3932672,36.89075391423072,14.92,null,{"$f":"INDEX(Integrale!$H$3:$H$502,MATCH(UGCA444!D39,Integrale!$H$3:$H$502,1))","v":0.69},{"$f":"INDEX(Integrale!$I$3:$I$502,MATCH(UGCA444!D39,Integrale!$H$3:$H$502,1))","v":0.0413588991},{"$f":"INDEX(Integrale!$H$3:$H$502,MATCH(UGCA444!D39,Integrale!$H$3:$H$502,1)+1)","v":0.7},{"$f":"INDEX(Integrale!$I$3:$I$502,MATCH(UGCA444!D39,Integrale!$H$3:$H$502,1)+1)","v":0.0421620429},0.15267175572518651,0.8473282442748135]
[1.9,32.9,4.36,0.7251908396946565,0.04411260077480916,607620890.839102,37.08678789719492,12.73,null,{"$f":"INDEX(Integrale!$H$3:$H$502,MATCH(UGCA444!D40,Integrale!$H$3:$H$502,1))","v":0.72},{"$f":"INDEX(Integrale!$I$3:$I$502,MATCH(UGCA444!D40,Integrale!$H$3:$H$502,1))","v":0.0437207705},{"$f":"INDEX(Integrale!$H$3:$H$502,MATCH(UGCA444!D40,Integrale!$H$3:$H$502,1)+1)","v":0.73},{"$f":"INDEX(Integrale!$I$3:$I$502,MATCH(UGCA444!D40,Integrale!$H$3:$H$502,1)+1)","v":0.04447562},0.4809160305343503,0.5190839694656497]
[1.97,34.2,4.9,0.7519083969465649,0.04606915419618321,634571075.411953,37.220885042811474,8.83,null,{"$f":"INDEX(Integrale!$H$3:$H$502,MATCH(UGCA444!D41,Integrale!$H$3:$H$502,1))","v":0.75},{"$f":"INDEX(Integrale!$I$3:$I$502,MATCH(UGCA444!D41,Integrale!$H$3:$H$502,1))","v":0.0459348212},{"$f":"INDEX(Integrale!$H$3:$H$502,MATCH(UGCA444!D41,Integrale!$H$3:$H$502,1)+1)","v":0.76},{"$f":"INDEX(Integrale!$I$3:$I$502,MATCH(UGCA444!D41,Integrale!$H$3:$H$502,1)+1)","v":0.0466387261},0.8091603053435141,0.19083969465648593]
[2.04,32.6,3.98,0.7786259541984732,0.047902424858778624,659823124.3410548,37.297382520514624,14.41,null,{"$f":"INDEX(Integrale!$H$3:$H$502,MATCH(UGCA444!D42,Integrale!$H$3:$H$502,1))","v":0.77},{"$f":"INDEX(Integrale!$I$3:$I$502,MATCH(UGCA444!D42,Integrale!$H$3:$H$502,1))","v":0.0473252771},{"$f":"INDEX(Integrale!$H$3:$H$502,MATCH(UGCA444!D42,Integrale!$H$3:$H$502,1)+1)","v":0.78},{"$f":"INDEX(Integrale!$I$3:$I$502,MATCH(UGCA444!D42,Integrale!$H$3:$H$502,1)+1)","v":0.0479943599},0.13740458015267787,0.8625954198473221]
[2.11,33.7,4.73,0.8053435114503816,0.04960923161984733,683333219.5618064,37.32112373420165,10.75,null,{"$f":"INDEX(Integrale!$H$3:$H$502,MATCH(UGCA444!D43,Integrale!$H$3:$H$502,1))","v":0.8},{"$f":"INDEX(Integrale!$I$3:$I$502,MATCH(UGCA444!D43,Integrale!$H$3:$H$502,1))","v":0.0492798642},{"$f":"INDEX(Integrale!$H$3:$H$502,MATCH(UGCA444!D43,Integrale!$H$3:$H$502,1)+1)","v":0.81},{"$f":"INDEX(Integrale!$I$3:$I$502,MATCH(UGCA444!D43,Integrale!$H$3:$H$502,1)+1)","v":0.0498962518},0.46564885496184166,0.5343511450381584]
[2.19,33.8,4.67,0.8358778625954197,0.051407992529770984,708109920.2617686,37.291337004050945,10.33,null,{"$f":"INDEX(Integrale!$H$3:$H$502,MATCH(UGCA444!D44,Integrale!$H$3:$H$502,1))","v":0.83},{"$f":"INDEX(Integrale!$I$3:$I$502,MATCH(UGCA444!D44,Integrale!$H$3:$H$502,1))","v":0.0510764772},{"$f":"INDEX(Integrale!$H$3:$H$502,MATCH(UGCA444!D44,Integrale!$H$3:$H$502,1)+1)","v":0.84},{"$f":"INDEX(Integrale!$I$3:$I$502,MATCH(UGCA444!D44,Integrale!$H$3:$H$502,1)+1)","v":0.0516404838},0.41221374045802245,0.5877862595419775]
[2.26,34.9,3.74,0.8625954198473281,0.052850012718320606,727972761.631005,37.22056983449843,6.65,null,{"$f":"INDEX(Integrale!$H$3:$H$502,MATCH(UGCA444!D45,Integrale!$H$3:$H$502,1))","v":0.86},{"$f":"INDEX(Integrale!$I$3:$I$502,MATCH(UGCA444!D45,Integrale!$H$3:$H$502,1))","v":0.0527169267},{"$f":"INDEX(Integrale!$H$3:$H$502,MATCH(UGCA444!D45,Integrale!$H$3:$H$502,1)+1)","v":0.87},{"$f":"INDEX(Integrale!$I$3:$I$502,MATCH(UGCA444!D45,Integrale!$H$3:$H$502,1)+1)","v":0.0532296993},0.7404580152671862,0.25954198473281376]
[2.33,36.1,5.47,0.8893129770992366,0.054172414893893135,746187946.722241,37.112979926094795,2.81,null,{"$f":"INDEX(Integrale!$H$3:$H$502,MATCH(UGCA444!D46,Integrale!$H$3:$H$502,1))","v":0.88},{"$f":"INDEX(Integrale!$I$3:$I$502,MATCH(UGCA444!D46,Integrale!$H$3:$H$502,1))","v":0.0537257701},{"$f":"INDEX(Integrale!$H$3:$H$502,MATCH(UGCA444!D46,Integrale!$H$3:$H$502,1)+1)","v":0.89},{"$f":"INDEX(Integrale!$I$3:$I$502,MATCH(UGCA444!D46,Integrale!$H$3:$H$502,1)+1)","v":0.0542053641},0.06870229007633893,0.9312977099236611]
[2.4,37.2,5.39,0.916030534351145,0.055376454404580146,762772767.0964435,36.97188906230592,0.61,null,{"$f":"INDEX(Integrale!$H$3:$H$502,MATCH(UGCA444!D47,Integrale!$H$3:$H$502,1))","v":0.91},{"$f":"INDEX(Integrale!$I$3:$I$502,MATCH(UGCA444!D47,Integrale!$H$3:$H$502,1))","v":0.0551161169},{"$f":"INDEX(Integrale!$H$3:$H$502,MATCH(UGCA444!D47,Integrale!$H$3:$H$502,1)+1)","v":0.92},{"$f":"INDEX(Integrale!$I$3:$I$502,MATCH(UGCA444!D47,Integrale!$H$3:$H$502,1)+1)","v":0.0555478158},0.39694656488550273,0.6030534351144973]
[2.48,37.6,7.1,0.9465648854961831,0.05661900053435115,779887989.7996871,36.77646213913952,2.19,null,{"$f":"INDEX(Integrale!$H$3:$H$502,MATCH(UGCA444!D48,Integrale!$H$3:$H$502,1))","v":0.94},{"$f":"INDEX(Integrale!$I$3:$I$502,MATCH(UGCA444!D48,Integrale!$H$3:$H$502,1))","v":0.0563653178},{"$f":"INDEX(Integrale!$H$3:$H$502,MATCH(UGCA444!D48,Integrale!$H$3:$H$502,1)+1)","v":0.95},{"$f":"INDEX(Integrale!$I$3:$I$502,MATCH(UGCA444!D48,Integrale!$H$3:$H$502,1)+1)","v":0.0567517415},0.34351145038168357,0.6564885496183165]
[2.55,35.6,4.73,0.9732824427480915,0.05759449775114504,793324796.459653,36.57927526964255,2.75,null,{"$f":"INDEX(Integrale!$H$3:$H$502,MATCH(UGCA444!D49,Integrale!$H$3:$H$502,1))","v":0.97},{"$f":"INDEX(Integrale!$I$3:$I$502,MATCH(UGCA444!D49,Integrale!$H$3:$H$502,1))","v":0.0574815594},{"$f":"INDEX(Integrale!$H$3:$H$502,MATCH(UGCA444!D49,Integrale!$H$3:$H$502,1)+1)","v":0.98},{"$f":"INDEX(Integrale!$I$3:$I$502,MATCH(UGCA444!D49,Integrale!$H$3:$H$502,1)+1)","v":0.0578256274},0.6717557251908474,0.3282442748091527]
[2.62,38.3,7.78,1,0.0584738086,805436701.718498,36.361746479383385,5.06,null,{"$f":"INDEX(Integrale!$H$3:$H$502,MATCH(UGCA444!D50,Integrale!$H$3:$H$502,1))","v":1},{"$f":"INDEX(Integrale!$I$3:$I$502,MATCH(UGCA444!D50,Integrale!$H$3:$H$502,1))","v":0.0584738086},{"$f":"INDEX(Integrale!$H$3:$H$502,MATCH(UGCA444!D50,Integrale!$H$3:$H$502,1)+1)","v":1.01},{"$f":"INDEX(Integrale!$I$3:$I$502,MATCH(UGCA444!D50,Integrale!$H$3:$H$502,1)+1)","v":0.0587786248},1,0]
[{"$nulls":6},"Erreur moy",{"$f":"ROUND(AVERAGE(H15:H50),2)","v":11.98}]
[null,"Précision=",{"$f":"ROUND(MAX(0,100-H51),2)","v":88.02},"%"]
[]
["R","V_Obs","Incer V_Obs","V_TURI","A=(V_obs-V_TURI)^2","A/Incer V_Obs^2"]
[{"$f":"A15","v":0.12},{"$f":"B15","v":6.48},{"$f":"C15","v":2.6},{"$f":"G15","v":4.078936418314541},{"$f":"ROUND(POWER((B55-D55),2),2)","v":5.77},{"$f":"ROUND(E55/POWER(C55,2),2)","v":0.85}]
[{"$f":"A16","v":0.19},8.6,2.65,{"$f":"G16","v":6.318213128725699},{"$f":"ROUND(POWER((B56-D56),2),2)","v":5.21},{"$f":"ROUND(E56/POWER(C56,2),2)","v":0.74}]
[{"$f":"A17","v":0.26},10.2,3.03,8.543360828812933,2.74,0.3]
[{"$f":"A18","v":0.33},11.7,3.55,10.767456480767843,0.87,0.07]
[{"$f":"A19","v":0.4},12.7,3.75,12.91811423590083,0.05,0]
[{"$f":"A20","v":0.47},14.1,3.43,15.003406815589159,0.82,0.07]
[{"$f":"A21","v":0.55},16,3.33,17.307924156599288,1.71,0.15]
[{"$f":"A22","v":0.62},18.1,2.66,19.248337478206597,1.32,0.19]
[{"$f":"A23","v":0.69},21.2,3.78,21.09117061846962,0.01,0]
[{"$f":"A24","v":0.76},21.6,3.33,22.834958543960656,1.53,0.14]
[{"$f":"A25","v":0.83},23.3,3.09,24.490065301579765,1.42,0.15]
[{"$f":"A26","v":0.9},24.5,3.26,26.037513502614935,2.36,0.22]
[{"$f":"A27","v":0.97},24.4,3.29,27.476976946022553,9.47,0.87]
[{"$f":"A28","v":1.04},25.3,2.78,28.81385403155583,12.35,1.6]
[{"$f":"A29","v":1.11},25.4,2.78,30.040796055465194,21.54,2.79]
[{"$f":"A30","v":1.19},25.9,2.73,31.31131028364616,29.28,3.93]
[{"$f":"A31","v":1.26},26.7,2.67,32.308895516339675,31.46,4.41]
[{"$f":"A32","v":1.33},27.1,3.16,33.20317484693649,37.25,3.73]
[{"$f":"A33","v":1.4},28.6,3.34,33.996069647895176,29.12,2.61]
[{"$f":"A34","v":1.48},28.9,3.21,34.782896192509284,34.61,3.36]
[{"$f":"A35","v":1.55},30.4,4.14,35.37174824704107,24.72,1.44]
[{"$f":"A36","v":1.62},30.8,4.35,35.871908370069306,25.72,1.36]
[{"$f":"A37","v":1.69},30.5,4.56,36.28803107258614,33.5,1.61]
[{"$f":"A38","v":1.75},33,4.04,36.582500359807895,12.83,0.79]
[{"$f":"A39","v":1.83},32.1,4.35,36.89075391423072,22.95,1.21]
[{"$f":"A40","v":1.9},32.9,4.36,37.08678789719492,17.53,0.92]
{"$rows_left_out":12}
{"sheet":"Integrale","index":1,"n_rows":372,"n_cols":9,"rows_kept":372}
[{"$nulls":7},"u","I(u) = Integrale de 0 à u de ( x^2sech^8(x)dx"]
[{"$nulls":7},0,0]
[{"$nulls":7},0.01,4.998e-07]
[{"$nulls":7},0.02,2.9964e-06]
[{"$nulls":7},0.03,9.477e-06]
[{"$nulls":7},0.04,2.19098e-05]
[{"$nulls":7},0.05,4.22345e-05]
[{"$nulls":7},0.06,7.2353e-05]
[{"$nulls":7},0.07,0.0001141207]
[{"$nulls":7},0.08,1.693376E-4]
[{"$nulls":7},0.09,0.0002397401]
[{"$nulls":7},0.1,0.0003269934]
[{"$nulls":7},0.11,0.0004326832]
[{"$nulls":7},0.12,0.0005583096]
[{"$nulls":7},0.13,0.0007052805]
[{"$nulls":7},0.14,0.0008749055]
[{"$nulls":7},0.15,1.0683906E-3]
[{"$nulls":7},0.16,0.001286834]
[{"$nulls":7},0.17,0.001531222]
[{"$nulls":7},0.18,1.8024255E-3]
[{"$nulls":7},0.19,0.0021011974]
[{"$nulls":7},0.2,0.0024281708]
[{"$nulls":7},0.21,0.0027838579]
[{"$nulls":7},0.22,0.0031686489]
[{"$nulls":7},0.23,0.0035828125]
[{"$nulls":7},0.24,0.0040264964]
[{"$nulls":7},0.25,4.4997288E-3]
[{"$nulls":7},0.26,0.0050024204]
[{"$nulls":7},0.27,5.5343666E-3]
[{"$nulls":7},0.28,0.006095251]
[{"$nulls":7},0.29,0.0066846487]
[{"$nulls":7},0.3,0.0073020305]
[{"$nulls":7},0.31,0.0079467677]
[{"$nulls":7},0.32,0.0086181365]
[{"$nulls":7},0.33,0.0093153237]
[{"$nulls":7},0.34,0.010037432]
[{"$nulls":7},0.35,0.0107834863]
[{"$nulls":7},0.36,0.0115524392]
[{"$nulls":7},0.37,0.0123431779]
[{"$nulls":7},0.38,0.0131545302]
[{"$nulls":7},0.39,0.0139852712]
[{"$nulls":7},0.4,0.0148341297]
[{"$nulls":7},0.41,0.0156997951]
[{"$nulls":7},0.42,0.0165809236]
[{"$nulls":7},0.43,0.0174761447]
[{"$nulls":7},0.44,0.0183840679]
[{"$nulls":7},0.45,0.0193032886]
[{"$nulls":7},0.46,0.0202323944]
[{"$nulls":7},0.47,0.0211699709]
[{"$nulls":7},0.48,0.0221146072]
[{"$nulls":7},0.49,0.0230649017]
[{"$nulls":7},0.5,0.0240194669]
[{"$nulls":7},0.51,0.0249769344]
[{"$nulls":7},0.52,0.0259359595]
[{"$nulls":7},0.53,0.0268952255]
[{"$nulls":7},0.54,0.0278534477]
[{"$nulls":7},0.55,0.0288093767]
[{"$nulls":7},0.56,0.0297618021]
[{"$nulls":7},0.57,0.0307095554]
[{"$nulls":7},0.58,0.0316515125]
[{"$nulls":7},0.59,0.0325865959]
[{"$nulls":7},0.6,0.0335137772]
[{"$nulls":7},0.61,0.0344320783]
[{"$nulls":7},0.62,0.0353405729]
[{"$nulls":7},0.63,0.0362383877]
[{"$nulls":7},0.64,0.037124703]
[{"$nulls":7},0.65,0.0379987533]
[{"$nulls":7},0.66,0.0388598276]
[{"$nulls":7},0.67,0.0397072693]
[{"$nulls":7},0.68,0.040540476]
[{"$nulls":7},0.69,0.0413588991]
[{"$nulls":7},0.7,0.0421620429]
[{"$nulls":7},0.71,0.0429494641]
[{"$nulls":7},0.72,0.0437207705]
[{"$nulls":7},0.73,0.04447562]
[{"$nulls":7},0.74,0.0452137189]
[{"$nulls":7},0.75,0.0459348212]
[{"$nulls":7},0.76,0.0466387261]
[{"$nulls":7},0.77,0.0473252771]
[{"$nulls":7},0.78,0.0479943599]
{"$rows_left_out":293}
{"sheet":"Feuil3","index":2,"n_rows":0,"n_cols":0,"rows_kept":0}