{"text_format":"3","workbook":"xlsx","n_sheets":3,"sheets":["NGC5005","Integrale","Feuil3"],"not_rendered":{"charts":1},"read":"whole","date_system":"1900"}

{"sheet":"NGC5005","index":0,"n_rows":55,"n_cols":15,"rows_kept":55,"merged":[[9,2,9,3],[13,9,13,14]]}
[]
[]
[null,"ρ(r) = ρ0sech^8( r/ r_c)"]
[]
[]
["M(R) =4πρ0,r_c^3 ·I(u)",null,"u = R/r_c","I(u) = Integrale de 0 à u de ( x^2sech^8(x)dx",{"$nulls":3},"V_TURI(R) = Racine (G·M(R)/R)"]
[]
[{"$nulls":7},"G=",{"$f":"4.3009*POWER(10,-6)","v":4.3009000000000006E-6},"10^-6,KPC,(Km/s)^2/Mo"]
["NGC5005","R_max=",{"$f":"A32","v":11.47},"V_obs(R_max)=",{"$f":"B32","v":265}]
[null,"M_totale=","V_obs^2(R_max).R_max/G=",null,{"$f":"E9*E9*C9/I8","v":187281906112.67407},"Mo","I(infini)=",0.0648738184]
[{"$nulls":6},"M(R) = racine(G,M(R)/R)"]
[null,"r_c=R_max/1,5=",{"$f":"C9/1.5","v":7.646666666666667},"ρ0=M_tot/4.π.r_c^3.I(infini)=",{"$f":"E10/(POWER(C12,3)*4*3.14159*H10)","v":513807437.3389015},"Mo/kpc^3","π=",3.14159]
[]
["R","V_obs","Incer V_obs","u=R/r-c","I(U) par table","M(R) ","V_TURI","Erreur %",null,"calculs intermediaires de I(u)"]
[0.49,211,40.1,{"$f":"A15/$C$12","v":0.06408020924149956},{"$f":"N15*K15+O15*M15","v":8.93950955536181e-05},{"$f":"4*$H$12*$E$12*POWER($C$12,3)*E15","v":258071504.11862037},{"$f":"POWER($I$8*F15/A15,0.5)","v":47.593940020350956},{"$f":"ROUND(ABS((B15-G15)/B15)*100,2)","v":77.44},null,{"$f":"INDEX(Integrale!$H$3:$H$502,MATCH('NGC5005'!D15,Integrale!$H$3:$H$502,1))","v":0.06},{"$f":"INDEX(Integrale!$I$3:$I$502,MATCH('NGC5005'!D15,Integrale!$H$3:$H$502,1))","v":7.2353e-05},{"$f":"INDEX(Integrale!$H$3:$H$502,MATCH('NGC5005'!D15,Integrale!$H$3:$H$502,1)+1)","v":0.07},{"$f":"INDEX(Integrale!$I$3:$I$502,MATCH('NGC5005'!D15,Integrale!$H$3:$H$502,1)+1)","v":0.0001141207},{"$f":"(L15-D15)/(L15-J15)","v":0.5919790758500446},{"$f":"(D15-J15)/(L15-J15)","v":0.4080209241499554}]
[0.98,233,17.4,{"$f":"A16/$C$12","v":0.1281604184829991},{"$f":"N16*K16+O16*M16","v":6.7824400488230132E-4},{"$f":"4*$H$12*$E$12*POWER($C$12,3)*E16","v":1957998360.149727},92.69851916990821,60.22,null,{"$f":"INDEX(Integrale!$H$3:$H$502,MATCH('NGC5005'!D16,Integrale!$H$3:$H$502,1))","v":0.12},{"$f":"INDEX(Integrale!$I$3:$I$502,MATCH('NGC5005'!D16,Integrale!$H$3:$H$502,1))","v":0.0005583096},{"$f":"INDEX(Integrale!$H$3:$H$502,MATCH('NGC5005'!D16,Integrale!$H$3:$H$502,1)+1)","v":0.13},{"$f":"INDEX(Integrale!$I$3:$I$502,MATCH('NGC5005'!D16,Integrale!$H$3:$H$502,1)+1)","v":0.0007052805},{"$f":"(L16-D16)/(L16-J16)","v":0.18395815170008917},0.8160418482999108]
[1.47,227,14.4,0.19224062772449868,2.1744599665213596E-3,6277370707.314827,135.52202842023982,40.3,null,{"$f":"INDEX(Integrale!$H$3:$H$502,MATCH('NGC5005'!D17,Integrale!$H$3:$H$502,1))","v":0.19},{"$f":"INDEX(Integrale!$I$3:$I$502,MATCH('NGC5005'!D17,Integrale!$H$3:$H$502,1))","v":0.0021011974},{"$f":"INDEX(Integrale!$H$3:$H$502,MATCH('NGC5005'!D17,Integrale!$H$3:$H$502,1)+1)","v":0.2},{"$f":"INDEX(Integrale!$I$3:$I$502,MATCH('NGC5005'!D17,Integrale!$H$3:$H$502,1)+1)","v":0.0024281708},0.7759372275501324,0.22406277244986764]
[1.97,234,10.8,0.25762859633827373,0.004883211929904096,14097169871.298784,175.43349919363843,25.03,null,{"$f":"INDEX(Integrale!$H$3:$H$502,MATCH('NGC5005'!D18,Integrale!$H$3:$H$502,1))","v":0.25},{"$f":"INDEX(Integrale!$I$3:$I$502,MATCH('NGC5005'!D18,Integrale!$H$3:$H$502,1))","v":4.4997288E-3},{"$f":"INDEX(Integrale!$H$3:$H$502,MATCH('NGC5005'!D18,Integrale!$H$3:$H$502,1)+1)","v":0.26},{"$f":"INDEX(Integrale!$I$3:$I$502,MATCH('NGC5005'!D18,Integrale!$H$3:$H$502,1)+1)","v":0.0050024204},0.23714036617262768,0.7628596338273723]
[2.46,245,7.67,0.32170880557977327,0.00873727223775065,25223318732.71222,209.99706883119077,14.29,null,{"$f":"INDEX(Integrale!$H$3:$H$502,MATCH('NGC5005'!D19,Integrale!$H$3:$H$502,1))","v":0.32},{"$f":"INDEX(Integrale!$I$3:$I$502,MATCH('NGC5005'!D19,Integrale!$H$3:$H$502,1))","v":0.0086181365},{"$f":"INDEX(Integrale!$H$3:$H$502,MATCH('NGC5005'!D19,Integrale!$H$3:$H$502,1)+1)","v":0.33},{"$f":"INDEX(Integrale!$I$3:$I$502,MATCH('NGC5005'!D19,Integrale!$H$3:$H$502,1)+1)","v":0.0093153237},0.8291194420226736,0.17088055797732635]
[2.95,244,23.3,0.38578901482127287,0.013635447396163902,39363685413.23095,239.56123352507586,1.82,null,{"$f":"INDEX(Integrale!$H$3:$H$502,MATCH('NGC5005'!D20,Integrale!$H$3:$H$502,1))","v":0.38},{"$f":"INDEX(Integrale!$I$3:$I$502,MATCH('NGC5005'!D20,Integrale!$H$3:$H$502,1))","v":0.0131545302},{"$f":"INDEX(Integrale!$H$3:$H$502,MATCH('NGC5005'!D20,Integrale!$H$3:$H$502,1)+1)","v":0.39},{"$f":"INDEX(Integrale!$I$3:$I$502,MATCH('NGC5005'!D20,Integrale!$H$3:$H$502,1)+1)","v":0.0139852712},0.4210985178727141,0.5789014821272859]
[3.44,261,23.3,0.4498692240627724,0.01929126740514385,55691269915.5171,263.8724271021534,1.1,null,{"$f":"INDEX(Integrale!$H$3:$H$502,MATCH('NGC5005'!D21,Integrale!$H$3:$H$502,1))","v":0.44},{"$f":"INDEX(Integrale!$I$3:$I$502,MATCH('NGC5005'!D21,Integrale!$H$3:$H$502,1))","v":0.0183840679},{"$f":"INDEX(Integrale!$H$3:$H$502,MATCH('NGC5005'!D21,Integrale!$H$3:$H$502,1)+1)","v":0.45},{"$f":"INDEX(Integrale!$I$3:$I$502,MATCH('NGC5005'!D21,Integrale!$H$3:$H$502,1)+1)","v":0.0193032886},0.01307759372276006,0.9869224062772399]
[3.93,259,22.7,0.513949433304272,0.02535569496695728,73198448948.13985,283.03121555292734,9.28,null,{"$f":"INDEX(Integrale!$H$3:$H$502,MATCH('NGC5005'!D22,Integrale!$H$3:$H$502,1))","v":0.51},{"$f":"INDEX(Integrale!$I$3:$I$502,MATCH('NGC5005'!D22,Integrale!$H$3:$H$502,1))","v":0.0249769344},{"$f":"INDEX(Integrale!$H$3:$H$502,MATCH('NGC5005'!D22,Integrale!$H$3:$H$502,1)+1)","v":0.52},{"$f":"INDEX(Integrale!$I$3:$I$502,MATCH('NGC5005'!D22,Integrale!$H$3:$H$502,1)+1)","v":0.0259359595},0.6050566695728005,0.39494333042719953]
[4.42,258,22.7,0.5780296425457715,0.03146591328064516,90837819664.63269,297.3047778021506,15.23,null,{"$f":"INDEX(Integrale!$H$3:$H$502,MATCH('NGC5005'!D23,Integrale!$H$3:$H$502,1))","v":0.57},{"$f":"INDEX(Integrale!$I$3:$I$502,MATCH('NGC5005'!D23,Integrale!$H$3:$H$502,1))","v":0.0307095554},{"$f":"INDEX(Integrale!$H$3:$H$502,MATCH('NGC5005'!D23,Integrale!$H$3:$H$502,1)+1)","v":0.58},{"$f":"INDEX(Integrale!$I$3:$I$502,MATCH('NGC5005'!D23,Integrale!$H$3:$H$502,1)+1)","v":0.0316515125},0.19703574542284646,0.8029642545771536]
[4.92,258,22.5,0.6434176111595465,0.0374234194059285,108036331026.20525,307.3137799905407,19.11,null,{"$f":"INDEX(Integrale!$H$3:$H$502,MATCH('NGC5005'!D24,Integrale!$H$3:$H$502,1))","v":0.64},{"$f":"INDEX(Integrale!$I$3:$I$502,MATCH('NGC5005'!D24,Integrale!$H$3:$H$502,1))","v":0.037124703},{"$f":"INDEX(Integrale!$H$3:$H$502,MATCH('NGC5005'!D24,Integrale!$H$3:$H$502,1)+1)","v":0.65},{"$f":"INDEX(Integrale!$I$3:$I$502,MATCH('NGC5005'!D24,Integrale!$H$3:$H$502,1)+1)","v":0.0379987533},0.6582388840453474,0.3417611159546527]
[5.74,261,22.4,0.7506538796861377,0.045980848111508286,132740465898.03662,315.37364316795544,20.83,null,{"$f":"INDEX(Integrale!$H$3:$H$502,MATCH('NGC5005'!D25,Integrale!$H$3:$H$502,1))","v":0.75},{"$f":"INDEX(Integrale!$I$3:$I$502,MATCH('NGC5005'!D25,Integrale!$H$3:$H$502,1))","v":0.0459348212},{"$f":"INDEX(Integrale!$H$3:$H$502,MATCH('NGC5005'!D25,Integrale!$H$3:$H$502,1)+1)","v":0.76},{"$f":"INDEX(Integrale!$I$3:$I$502,MATCH('NGC5005'!D25,Integrale!$H$3:$H$502,1)+1)","v":0.0466387261},0.9346120313862275,0.06538796861377255]
[6.56,263,22.4,0.8578901482127287,{"$f":"N26*K26+O26*M26","v":0.05260517242920662},151863990850.3937,315.54053464062173,19.98,null,{"$f":"INDEX(Integrale!$H$3:$H$502,MATCH('NGC5005'!D26,Integrale!$H$3:$H$502,1))","v":0.85},{"$f":"INDEX(Integrale!$I$3:$I$502,MATCH('NGC5005'!D26,Integrale!$H$3:$H$502,1))","v":0.0521872484},{"$f":"INDEX(Integrale!$H$3:$H$502,MATCH('NGC5005'!D26,Integrale!$H$3:$H$502,1)+1)","v":0.86},{"$f":"INDEX(Integrale!$I$3:$I$502,MATCH('NGC5005'!D26,Integrale!$H$3:$H$502,1)+1)","v":0.0527169267},0.21098517872712977,0.7890148212728703]
[7.37,264,22.3,{"$f":"A27/$C$12","v":0.9638186573670444},{"$f":"N27*K27+O27*M27","v":0.05726036098108109},{"$f":"4*$H$12*$E$12*POWER($C$12,3)*E27","v":165302888186.9647},{"$f":"POWER($I$8*F27/A27,0.5)","v":310.5890564418748},{"$f":"ROUND(ABS((B27-G27)/B27)*100,2)","v":17.65},null,{"$f":"INDEX(Integrale!$H$3:$H$502,MATCH('NGC5005'!D27,Integrale!$H$3:$H$502,1))","v":0.96},{"$f":"INDEX(Integrale!$I$3:$I$502,MATCH('NGC5005'!D27,Integrale!$H$3:$H$502,1))","v":0.0571237109},{"$f":"INDEX(Integrale!$H$3:$H$502,MATCH('NGC5005'!D27,Integrale!$H$3:$H$502,1)+1)","v":0.97},{"$f":"INDEX(Integrale!$I$3:$I$502,MATCH('NGC5005'!D27,Integrale!$H$3:$H$502,1)+1)","v":0.0574815594},{"$f":"(L27-D27)/(L27-J27)","v":0.618134263295555},{"$f":"(D27-J27)/(L27-J27)","v":0.381865736704445}]
[8.19,265,22.2,1.0710549258936355,0.060383850033827374,174319977021.0697,302.559853748167,14.17,null,{"$f":"INDEX(Integrale!$H$3:$H$502,MATCH('NGC5005'!D28,Integrale!$H$3:$H$502,1))","v":1.07},{"$f":"INDEX(Integrale!$I$3:$I$502,MATCH('NGC5005'!D28,Integrale!$H$3:$H$502,1))","v":0.0603600483},{"$f":"INDEX(Integrale!$H$3:$H$502,MATCH('NGC5005'!D28,Integrale!$H$3:$H$502,1)+1)","v":1.08},{"$f":"INDEX(Integrale!$I$3:$I$502,MATCH('NGC5005'!D28,Integrale!$H$3:$H$502,1)+1)","v":0.060585673},0.8945074106364573,0.10549258936354268]
[9.01,265,22.2,1.1782911944202266,0.062326853524237134,179929164305.58936,293.0677691041277,10.59,null,{"$f":"INDEX(Integrale!$H$3:$H$502,MATCH('NGC5005'!D29,Integrale!$H$3:$H$502,1))","v":1.17},{"$f":"INDEX(Integrale!$I$3:$I$502,MATCH('NGC5005'!D29,Integrale!$H$3:$H$502,1))","v":0.0622098525},{"$f":"INDEX(Integrale!$H$3:$H$502,MATCH('NGC5005'!D29,Integrale!$H$3:$H$502,1)+1)","v":1.18},{"$f":"INDEX(Integrale!$I$3:$I$502,MATCH('NGC5005'!D29,Integrale!$H$3:$H$502,1)+1)","v":0.0623509673},0.17088055797733745,0.8291194420226625]
[9.83,264,22,1.2855274629468176,0.06347660542371403,183248341943.06137,283.1541560345623,7.26,null,{"$f":"INDEX(Integrale!$H$3:$H$502,MATCH('NGC5005'!D30,Integrale!$H$3:$H$502,1))","v":1.28},{"$f":"INDEX(Integrale!$I$3:$I$502,MATCH('NGC5005'!D30,Integrale!$H$3:$H$502,1))","v":0.0634321492},{"$f":"INDEX(Integrale!$H$3:$H$502,MATCH('NGC5005'!D30,Integrale!$H$3:$H$502,1)+1)","v":1.29},{"$f":"INDEX(Integrale!$I$3:$I$502,MATCH('NGC5005'!D30,Integrale!$H$3:$H$502,1)+1)","v":0.0635125771},0.44725370531823977,0.5527462946817603]
[10.65,264,21.9,1.3927637314734087,0.06412921302528335,185132331487.37842,273.42990012274254,3.57,null,{"$f":"INDEX(Integrale!$H$3:$H$502,MATCH('NGC5005'!D31,Integrale!$H$3:$H$502,1))","v":1.39},{"$f":"INDEX(Integrale!$I$3:$I$502,MATCH('NGC5005'!D31,Integrale!$H$3:$H$502,1))","v":0.0641170452},{"$f":"INDEX(Integrale!$H$3:$H$502,MATCH('NGC5005'!D31,Integrale!$H$3:$H$502,1)+1)","v":1.4},{"$f":"INDEX(Integrale!$I$3:$I$502,MATCH('NGC5005'!D31,Integrale!$H$3:$H$502,1)+1)","v":0.064161072},0.7236268526591199,0.27637314734088014]
[11.47,265,22,1.5,0.0644867222,186164411937.47418,264.20820158342536,0.3,null,{"$f":"INDEX(Integrale!$H$3:$H$502,MATCH('NGC5005'!D32,Integrale!$H$3:$H$502,1))","v":1.5},{"$f":"INDEX(Integrale!$I$3:$I$502,MATCH('NGC5005'!D32,Integrale!$H$3:$H$502,1))","v":0.0644867222},{"$f":"INDEX(Integrale!$H$3:$H$502,MATCH('NGC5005'!D32,Integrale!$H$3:$H$502,1)+1)","v":1.51},{"$f":"INDEX(Integrale!$I$3:$I$502,MATCH('NGC5005'!D32,Integrale!$H$3:$H$502,1)+1)","v":0.0645100253},1,0]
[{"$nulls":6},"Erreur moy",{"$f":"ROUND(AVERAGE(H15:H32),2)","v":19.9}]
[null,"Précision=",{"$f":"ROUND(MAX(0,100-H33),2)","v":80.1},"%"]
[]
["R","V_Obs","Incer V_Obs","V_TURI","A=(V_obs-V_TURI)^2","A/Incer V_Obs^2"]
[{"$f":"A15","v":0.49},211,40.1,{"$f":"ROUND(G15,2)","v":47.59},{"$f":"ROUND(POWER((B37-D37),2),2)","v":26702.83},{"$f":"ROUND(E37/POWER(C37,2),2)","v":16.61}]
[0.98,233,17.4,{"$f":"ROUND(G16,2)","v":92.7},{"$f":"ROUND(POWER((B38-D38),2),2)","v":19684.09},{"$f":"ROUND(E38/POWER(C38,2),2)","v":65.02}]
[1.47,227,14.4,135.52,8368.59,40.36]
[1.97,234,10.8,175.43,3430.44,29.41]
[2.46,245,7.67,210,1225,20.82]
[2.95,244,23.3,239.56,19.71,0.04]
[3.44,261,23.3,263.87,8.24,0.02]
[3.93,259,22.7,283.03,577.44,1.12]
[4.42,258,22.7,297.3,1544.49,3]
[4.92,258,22.5,307.31,2431.48,4.8]
[5.74,261,22.4,315.37,2956.1,5.89]
[6.56,263,22.4,315.54,2760.45,5.5]
[7.37,264,22.3,310.59,2170.63,4.36]
[8.19,265,22.2,302.56,1410.75,2.86]
[9.01,265,22.2,293.07,787.92,1.6]
[9.83,264,22,283.15,366.72,0.76]
[10.65,264,21.9,273.43,88.92,0.19]
[11.47,265,22,264.21,0.62,0]
[{"$nulls":4},"X^2/d_f=",{"$f":"ROUND(SUM(F37:F54)/(COUNT(F37:F54)-1),2)","v":11.9}]

{"sheet":"Integrale","index":1,"n_rows":372,"n_cols":9,"rows_kept":372}
[{"$nulls":7},"u","I(u) = Integrale de 0 à u de ( x^2sech^8(x)dx"]
[{"$nulls":7},0,0]
[{"$nulls":7},0.01,4.998e-07]
[{"$nulls":7},0.02,2.9964e-06]
[{"$nulls":7},0.03,9.477e-06]
[{"$nulls":7},0.04,2.19098e-05]
[{"$nulls":7},0.05,4.22345e-05]
[{"$nulls":7},0.06,7.2353e-05]
[{"$nulls":7},0.07,0.0001141207]
[{"$nulls":7},0.08,1.693376E-4]
[{"$nulls":7},0.09,0.0002397401]
[{"$nulls":7},0.1,0.0003269934]
[{"$nulls":7},0.11,0.0004326832]
[{"$nulls":7},0.12,0.0005583096]
[{"$nulls":7},0.13,0.0007052805]
[{"$nulls":7},0.14,0.0008749055]
[{"$nulls":7},0.15,1.0683906E-3]
[{"$nulls":7},0.16,0.001286834]
[{"$nulls":7},0.17,0.001531222]
[{"$nulls":7},0.18,1.8024255E-3]
[{"$nulls":7},0.19,0.0021011974]
[{"$nulls":7},0.2,0.0024281708]
[{"$nulls":7},0.21,0.0027838579]
[{"$nulls":7},0.22,0.0031686489]
[{"$nulls":7},0.23,0.0035828125]
[{"$nulls":7},0.24,0.0040264964]
[{"$nulls":7},0.25,4.4997288E-3]
[{"$nulls":7},0.26,0.0050024204]
[{"$nulls":7},0.27,5.5343666E-3]
[{"$nulls":7},0.28,0.006095251]
[{"$nulls":7},0.29,0.0066846487]
[{"$nulls":7},0.3,0.0073020305]
[{"$nulls":7},0.31,0.0079467677]
[{"$nulls":7},0.32,0.0086181365]
[{"$nulls":7},0.33,0.0093153237]
[{"$nulls":7},0.34,0.010037432]
[{"$nulls":7},0.35,0.0107834863]
[{"$nulls":7},0.36,0.0115524392]
[{"$nulls":7},0.37,0.0123431779]
[{"$nulls":7},0.38,0.0131545302]
[{"$nulls":7},0.39,0.0139852712]
[{"$nulls":7},0.4,0.0148341297]
[{"$nulls":7},0.41,0.0156997951]
[{"$nulls":7},0.42,0.0165809236]
[{"$nulls":7},0.43,0.0174761447]
[{"$nulls":7},0.44,0.0183840679]
[{"$nulls":7},0.45,0.0193032886]
[{"$nulls":7},0.46,0.0202323944]
[{"$nulls":7},0.47,0.0211699709]
[{"$nulls":7},0.48,0.0221146072]
[{"$nulls":7},0.49,0.0230649017]
[{"$nulls":7},0.5,0.0240194669]
[{"$nulls":7},0.51,0.0249769344]
[{"$nulls":7},0.52,0.0259359595]
[{"$nulls":7},0.53,0.0268952255]
[{"$nulls":7},0.54,0.0278534477]
[{"$nulls":7},0.55,0.0288093767]
[{"$nulls":7},0.56,0.0297618021]
[{"$nulls":7},0.57,0.0307095554]
[{"$nulls":7},0.58,0.0316515125]
[{"$nulls":7},0.59,0.0325865959]
[{"$nulls":7},0.6,0.0335137772]
[{"$nulls":7},0.61,0.0344320783]
[{"$nulls":7},0.62,0.0353405729]
[{"$nulls":7},0.63,0.0362383877]
[{"$nulls":7},0.64,0.037124703]
[{"$nulls":7},0.65,0.0379987533]
[{"$nulls":7},0.66,0.0388598276]
[{"$nulls":7},0.67,0.0397072693]
[{"$nulls":7},0.68,0.040540476]
[{"$nulls":7},0.69,0.0413588991]
[{"$nulls":7},0.7,0.0421620429]
[{"$nulls":7},0.71,0.0429494641]
[{"$nulls":7},0.72,0.0437207705]
[{"$nulls":7},0.73,0.04447562]
[{"$nulls":7},0.74,0.0452137189]
[{"$nulls":7},0.75,0.0459348212]
[{"$nulls":7},0.76,0.0466387261]
[{"$nulls":7},0.77,0.0473252771]
[{"$nulls":7},0.78,0.0479943599]
[{"$nulls":7},0.79,0.0486459007]
[{"$nulls":7},0.8,0.0492798642]
[{"$nulls":7},0.81,0.0498962518]
[{"$nulls":7},0.82,0.0504950998]
[{"$nulls":7},0.83,0.0510764772]
[{"$nulls":7},0.84,0.0516404838]
[{"$nulls":7},0.85,0.0521872484]
[{"$nulls":7},0.86,0.0527169267]
[{"$nulls":7},0.87,0.0532296993]
[{"$nulls":7},0.88,0.0537257701]
[{"$nulls":7},0.89,0.0542053641]
[{"$nulls":7},0.9,0.0546687257]
[{"$nulls":7},0.91,0.0551161169]
[{"$nulls":7},0.92,0.0555478158]
[{"$nulls":7},0.93,0.0559641145]
[{"$nulls":7},0.94,0.0563653178]
[{"$nulls":7},0.95,0.0567517415]
[{"$nulls":7},0.96,0.0571237109]
[{"$nulls":7},0.97,0.0574815594]
[{"$nulls":7},0.98,0.0578256274]
[{"$nulls":7},0.99,0.0581562605]
[{"$nulls":7},1,0.0584738086]
[{"$nulls":7},1.01,0.0587786248]
[{"$nulls":7},1.02,0.059071064]
[{"$nulls":7},1.03,0.0593514822]
[{"$nulls":7},1.04,0.0596202355]
[{"$nulls":7},1.05,0.0598776791]
[{"$nulls":7},1.06,0.0601241663]
[{"$nulls":7},1.07,0.0603600483]
[{"$nulls":7},1.08,0.060585673]
[{"$nulls":7},1.09,0.0608013846]
[{"$nulls":7},1.1,0.0610075229]
[{"$nulls":7},1.11,0.0612044228]
[{"$nulls":7},1.12,0.0613924139]
[{"$nulls":7},1.13,0.0615718202]
[{"$nulls":7},1.14,0.0617429593]
[{"$nulls":7},1.15,0.0619061425]
[{"$nulls":7},1.16,0.0620616744]
[{"$nulls":7},1.17,0.0622098525]
[{"$nulls":7},1.18,0.0623509673]
[{"$nulls":7},1.19,0.0624853017]
[{"$nulls":7},1.2,0.0626131314]
[{"$nulls":7},1.21,0.0627347243]
[{"$nulls":7},1.22,0.0628503409]
[{"$nulls":7},1.23,0.0629602337]
[{"$nulls":7},1.24,0.0630646479]
[{"$nulls":7},1.25,0.0631638207]
[{"$nulls":7},1.26,0.0632579818]
[{"$nulls":7},1.27,0.0633473531]
[{"$nulls":7},1.28,0.0634321492]
[{"$nulls":7},1.29,0.0635125771]
[{"$nulls":7},1.3,0.0635888365]
[{"$nulls":7},1.31,0.0636611197]
[{"$nulls":7},1.32,0.0637296121]
[{"$nulls":7},1.33,0.0637944919]
[{"$nulls":7},1.34,0.0638559305]
[{"$nulls":7},1.35,0.0639140927]
[{"$nulls":7},1.36,0.0639691366]
[{"$nulls":7},1.37,0.064021214]
[{"$nulls":7},1.38,0.0640704704]
[{"$nulls":7},1.39,0.0641170452]
[{"$nulls":7},1.4,0.064161072]
[{"$nulls":7},1.41,0.0642026787]
[{"$nulls":7},1.42,0.0642419876]
[{"$nulls":7},1.43,0.0642791157]
[{"$nulls":7},1.44,0.0643141746]
[{"$nulls":7},1.45,0.064347271]
[{"$nulls":7},1.46,0.064378507]
[{"$nulls":7},1.47,0.0644079795]
[{"$nulls":7},1.48,0.0644357814]
[{"$nulls":7},1.49,0.0644620009]
[{"$nulls":7},1.5,0.0644867222]
[{"$nulls":7},1.51,0.0645100253]
[{"$nulls":7},1.52,0.0645319867]
[{"$nulls":7},1.53,0.0645526787]
[{"$nulls":7},1.54,0.0645721705]
[{"$nulls":7},1.55,0.0645905275]
[{"$nulls":7},1.56,0.0646078121]
[{"$nulls":7},1.57,0.0646240835]
[{"$nulls":7},1.58,0.0646393978]
[{"$nulls":7},1.59,0.0646538084]
[{"$nulls":7},1.6,0.0646673658]
[{"$nulls":7},1.61,0.064680118]
[{"$nulls":7},1.62,0.0646921104]
[{"$nulls":7},1.63,0.0647033862]
[{"$nulls":7},1.64,0.0647139861]
[{"$nulls":7},1.65,0.0647239487]
[{"$nulls":7},1.66,0.0647333107]
[{"$nulls":7},1.67,0.0647421067]
[{"$nulls":7},1.68,0.0647503694]
[{"$nulls":7},1.69,0.0647581297]
[{"$nulls":7},1.7,0.064765417]
[{"$nulls":7},1.71,0.064772259]
[{"$nulls":7},1.72,0.0647786817]
[{"$nulls":7},1.73,0.0647847098]
[{"$nulls":7},1.74,0.0647903667]
[{"$nulls":7},1.75,0.0647956744]
[{"$nulls":7},1.76,0.0648006536]
[{"$nulls":7},1.77,0.064805324]
[{"$nulls":7},1.78,0.0648097041]
[{"$nulls":7},1.79,0.0648138112]
[{"$nulls":7},1.8,0.0648176618]
[{"$nulls":7},1.81,0.0648212714]
[{"$nulls":7},1.82,0.0648246547]
[{"$nulls":7},1.83,0.0648278252]
[{"$nulls":7},1.84,0.0648307961]
[{"$nulls":7},1.85,0.0648335795]
[{"$nulls":7},1.86,0.0648361869]
[{"$nulls":7},1.87,0.0648386291]
[{"$nulls":7},1.88,0.0648409162]
[{"$nulls":7},1.89,0.0648430578]
[{"$nulls":7},1.9,0.064845063]
[{"$nulls":7},1.91,0.0648469402]
[{"$nulls":7},1.92,0.0648486973]
[{"$nulls":7},1.93,0.0648503418]
[{"$nulls":7},1.94,0.0648518808]
[{"$nulls":7},1.95,0.0648533208]
[{"$nulls":7},1.96,0.0648546681]
[{"$nulls":7},1.97,0.0648559285]
[{"$nulls":7},1.98,0.0648571074]
[{"$nulls":7},1.99,0.0648582101]
[{"$nulls":7},2,0.0648592413]
[{"$nulls":7},2.01,0.0648602055]
[{"$nulls":7},2.02,0.0648611071]
[{"$nulls":7},2.03,0.0648619499]
[{"$nulls":7},2.04,0.0648627378]
[{"$nulls":7},2.05,0.0648634742]
[{"$nulls":7},2.06,0.0648641625]
[{"$nulls":7},2.07,0.0648648057]
[{"$nulls":7},2.08,0.0648654067]
[{"$nulls":7},2.09,0.0648659683]
[{"$nulls":7},2.1,0.0648664929]
[{"$nulls":7},2.11,0.064866983]
[{"$nulls":7},2.12,0.0648674408]
[{"$nulls":7},2.13,0.0648678683]
[{"$nulls":7},2.14,0.0648682676]
[{"$nulls":7},2.15,0.0648686405]
[{"$nulls":7},2.16,0.0648689887]
[{"$nulls":7},2.17,0.0648693137]
[{"$nulls":7},2.18,0.0648696172]
[{"$nulls":7},2.19,0.0648699005]
[{"$nulls":7},2.2,0.064870165]
[{"$nulls":7},2.21,0.0648704118]
[{"$nulls":7},2.22,0.0648706421]
[{"$nulls":7},2.23,0.0648708571]
[{"$nulls":7},2.24,0.0648710577]
[{"$nulls":7},2.25,0.0648712449]
[{"$nulls":7},2.26,0.0648714195]
[{"$nulls":7},2.27,0.0648715824]
[{"$nulls":7},2.28,0.0648717344]
[{"$nulls":7},2.29,0.0648718761]
[{"$nulls":7},2.3,0.0648720084]
[{"$nulls":7},2.31,0.0648721317]
[{"$nulls":7},2.32,0.0648722467]
[{"$nulls":7},2.33,0.064872354]
[{"$nulls":7},2.34,0.064872454]
[{"$nulls":7},2.35,0.0648725472]
[{"$nulls":7},2.36,0.0648726342]
[{"$nulls":7},2.37,0.0648727152]
[{"$nulls":7},2.38,0.0648727908]
[{"$nulls":7},2.39,0.0648728612]
[{"$nulls":7},2.4,0.0648729269]
[{"$nulls":7},2.41,0.0648729881]
[{"$nulls":7},2.42,0.0648730451]
[{"$nulls":7},2.43,0.0648730983]
[{"$nulls":7},2.44,0.0648731478]
[{"$nulls":7},2.45,0.0648731939]
[{"$nulls":7},2.46,0.064873237]
[{"$nulls":7},2.47,0.064873277]
[{"$nulls":7},2.48,0.0648733144]
[{"$nulls":7},2.49,0.0648733491]
[{"$nulls":7},2.5,0.0648733815]
[{"$nulls":7},2.51,0.0648734117]
[{"$nulls":7},2.52,0.0648734398]
[{"$nulls":7},2.53,0.064873466]
[{"$nulls":7},2.54,0.0648734904]
[{"$nulls":7},2.55,0.0648735131]
[{"$nulls":7},2.56,0.0648735343]
[{"$nulls":7},2.57,0.064873554]
[{"$nulls":7},2.58,0.0648735723]
[{"$nulls":7},2.59,0.0648735894]
[{"$nulls":7},2.6,0.0648736053]
[{"$nulls":7},2.61,0.0648736201]
[{"$nulls":7},2.62,0.0648736339]
[{"$nulls":7},2.63,0.0648736467]
[{"$nulls":7},2.64,0.0648736587]
[{"$nulls":7},2.65,0.0648736698]
[{"$nulls":7},2.66,0.0648736802]
[{"$nulls":7},2.67,0.0648736898]
[{"$nulls":7},2.68,0.0648736988]
[{"$nulls":7},2.69,0.0648737071]
[{"$nulls":7},2.7,0.0648737149]
[{"$nulls":7},2.71,0.0648737221]
[{"$nulls":7},2.72,0.0648737289]
[{"$nulls":7},2.73,0.0648737351]
[{"$nulls":7},2.74,0.0648737409]
[{"$nulls":7},2.75,0.0648737464]
[{"$nulls":7},2.76,0.0648737514]
[{"$nulls":7},2.77,0.0648737561]
[{"$nulls":7},2.78,0.0648737605]
[{"$nulls":7},2.79,0.0648737645]
[{"$nulls":7},2.8,0.0648737683]
[{"$nulls":7},2.81,0.0648737718]
[{"$nulls":7},2.82,0.0648737751]
[{"$nulls":7},2.83,0.0648737782]
[{"$nulls":7},2.84,0.064873781]
[{"$nulls":7},2.85,0.0648737836]
[{"$nulls":7},2.86,0.0648737861]
[{"$nulls":7},2.87,0.0648737883]
[{"$nulls":7},2.88,0.0648737905]
[{"$nulls":7},2.89,0.0648737924]
[{"$nulls":7},2.9,0.0648737943]
[{"$nulls":7},2.91,0.064873796]
[{"$nulls":7},2.92,0.0648737976]
[{"$nulls":7},2.93,0.064873799]
[{"$nulls":7},2.94,0.0648738004]
[{"$nulls":7},2.95,0.0648738017]
[{"$nulls":7},2.96,0.0648738029]
[{"$nulls":7},2.97,0.064873804]
[{"$nulls":7},2.98,0.064873805]
[{"$nulls":7},2.99,0.0648738059]
[{"$nulls":7},3,0.0648738068]
[{"$nulls":7},3.1,0.0648738131]
[{"$nulls":7},3.2,0.0648738162]
[{"$nulls":7},3.3,0.0648738176]
[{"$nulls":7},3.4,0.0648738183]
[{"$nulls":7},3.5,0.0648738187]
[{"$nulls":7},3.6,0.0648738188]
[{"$nulls":7},3.7,0.0648738189]
[{"$nulls":7},3.8,0.0648738189]
[{"$nulls":7},3.9,0.0648738189]
[{"$nulls":7},4,0.064873819]
[{"$nulls":7},4.1,0.064873819]
[{"$nulls":7},4.2,0.064873819]
[{"$nulls":7},4.3,0.064873819]
[{"$nulls":7},4.4,0.064873819]
[{"$nulls":7},4.5,0.064873819]
[{"$nulls":7},4.6,0.064873819]
[{"$nulls":7},4.7,0.064873819]
[{"$nulls":7},4.8,0.064873819]
[{"$nulls":7},4.9,0.064873819]
[{"$nulls":7},5,0.064873819]
[{"$nulls":7},5.1,0.064873819]
[{"$nulls":7},5.2,0.064873819]
[{"$nulls":7},5.3,0.064873819]
[{"$nulls":7},5.4,0.064873819]
[{"$nulls":7},5.5,0.064873819]
[{"$nulls":7},5.6,0.064873819]
[{"$nulls":7},5.7,0.064873819]
[{"$nulls":7},5.8,0.064873819]
[{"$nulls":7},5.9,0.064873819]
[{"$nulls":7},6,0.064873819]
[{"$nulls":7},6.1,0.064873819]
[{"$nulls":7},6.2,0.064873819]
[{"$nulls":7},6.3,0.064873819]
[{"$nulls":7},6.4,0.064873819]
[{"$nulls":7},6.5,0.064873819]
[{"$nulls":7},6.6,0.064873819]
[{"$nulls":7},6.7,0.064873819]
[{"$nulls":7},6.8,0.064873819]
[{"$nulls":7},6.9,0.064873819]
[{"$nulls":7},7,0.064873819]
[{"$nulls":7},7.1,0.064873819]
[{"$nulls":7},7.2,0.064873819]
[{"$nulls":7},7.3,0.064873819]
[{"$nulls":7},7.4,0.064873819]
[{"$nulls":7},7.5,0.064873819]
[{"$nulls":7},7.6,0.064873819]
[{"$nulls":7},7.7,0.064873819]
[{"$nulls":7},7.8,0.064873819]
[{"$nulls":7},7.9,0.064873819]
[{"$nulls":7},8,0.064873819]
[{"$nulls":7},8.1,0.064873819]
[{"$nulls":7},8.2,0.064873819]
[{"$nulls":7},8.3,0.064873819]
[{"$nulls":7},8.4,0.064873819]
[{"$nulls":7},8.5,0.064873819]
[{"$nulls":7},8.6,0.064873819]
[{"$nulls":7},8.7,0.064873819]
[{"$nulls":7},8.8,0.064873819]
[{"$nulls":7},8.9,0.064873819]
[{"$nulls":7},9,0.064873819]
[{"$nulls":7},9.1,0.064873819]
[{"$nulls":7},9.2,0.064873819]
[{"$nulls":7},9.3,0.064873819]
[{"$nulls":7},9.4,0.064873819]
[{"$nulls":7},9.5,0.064873819]
[{"$nulls":7},9.6,0.064873819]
[{"$nulls":7},9.7,0.064873819]
[{"$nulls":7},9.8,0.064873819]
[{"$nulls":7},9.9,0.064873819]
[{"$nulls":7},10,0.064873819]

{"sheet":"Feuil3","index":2,"n_rows":0,"n_cols":0,"rows_kept":0}