{"text_format":"3","workbook":"xlsx","n_sheets":3,"sheets":["NGC7793","Integrale","Feuil3"],"not_rendered":{"charts":1},"read":"whole","date_system":"1900"}

{"sheet":"NGC7793","index":0,"n_rows":91,"n_cols":15,"rows_kept":91,"merged":[[9,2,9,3],[13,9,13,14]]}
[]
[]
[null,"ρ(r) = ρ0sech^8( r/ r_c)"]
[]
[]
["M(R) =4πρ0,r_c^3 ·I(u)",null,"u = R/r_c","I(u) = Integrale de 0 à u de ( x^2sech^8(x)dx",{"$nulls":3},"V_TURI(R) = Racine (G·M(R)/R)"]
[]
[{"$nulls":7},"G=",{"$f":"4.3009*POWER(10,-6)","v":4.3009000000000006E-6},"10^-6,KPC,(Km/s)^2/Mo"]
["NGC7793","R_core≈R_max/2=",{"$f":"A50","v":3.85},"V_obs(R_core)=",{"$f":"B50","v":112}]
[null,"M_totale=","V_obs^2(R_core).R_core/G=",null,{"$f":"(E9*E9*C9/I8)","v":11228905577.902298},"Mo","I(infini)=",0.0648738184]
[{"$nulls":6},"M(R) = racine(G,M(R)/R)"]
[null,"r_c=R_core=",{"$f":"C9","v":3.85},"ρ0=M_tot/4.π.r_c^3.I(infini)=",{"$f":"E10/(POWER(C12,3)*4*3.14159*H10)","v":241366105.72734118},"Mo/kpc^3","π=",3.14159]
[]
["R","V_obs","Incer V_obs","u=R/r-c","I(U) par table","M(R) ","V_TURI","Erreur %",null,"calculs intermediaires de I(u)"]
[0.11,9.1,8.5,{"$f":"A15/$C$12","v":0.02857142857142857},{"$f":"N15*K15+O15*M15","v":8.5511999999999987E-6},{"$f":"4*$H$12*$E$12*POWER($C$12,3)*E15","v":1480113.5457406358},{"$f":"POWER($I$8*F15/A15,0.5)","v":7.607305310074653},{"$f":"ROUND(ABS((B15-G15)/B15)*100,2)","v":16.4},null,{"$f":"INDEX(Integrale!$H$3:$H$502,MATCH('NGC7793'!D15,Integrale!$H$3:$H$502,1))","v":0.02},{"$f":"INDEX(Integrale!$I$3:$I$502,MATCH('NGC7793'!D15,Integrale!$H$3:$H$502,1))","v":2.9964e-06},{"$f":"INDEX(Integrale!$H$3:$H$502,MATCH('NGC7793'!D15,Integrale!$H$3:$H$502,1)+1)","v":0.03},{"$f":"INDEX(Integrale!$I$3:$I$502,MATCH('NGC7793'!D15,Integrale!$H$3:$H$502,1)+1)","v":9.477e-06},{"$f":"(L15-D15)/(L15-J15)","v":0.14285714285714285},{"$f":"(D15-J15)/(L15-J15)","v":0.8571428571428571}]
[0.14,17.6,7.4,{"$f":"A16/$C$12","v":0.03636363636363637},{"$f":"N16*K16+O16*M16","v":1.7388781818181826E-5},{"$f":"4*$H$12*$E$12*POWER($C$12,3)*E16","v":3009796.462837895},9.615773353870008,45.36,null,{"$f":"INDEX(Integrale!$H$3:$H$502,MATCH('NGC7793'!D16,Integrale!$H$3:$H$502,1))","v":0.03},{"$f":"INDEX(Integrale!$I$3:$I$502,MATCH('NGC7793'!D16,Integrale!$H$3:$H$502,1))","v":9.477e-06},{"$f":"INDEX(Integrale!$H$3:$H$502,MATCH('NGC7793'!D16,Integrale!$H$3:$H$502,1)+1)","v":0.04},{"$f":"INDEX(Integrale!$I$3:$I$502,MATCH('NGC7793'!D16,Integrale!$H$3:$H$502,1)+1)","v":2.19098e-05},{"$f":"(L16-D16)/(L16-J16)","v":0.36363636363636315},0.6363636363636369]
[0.17,19.3,7.4,0.04415584415584416,3.0356428571428568E-5,5254345.720937353,11.529607796803605,40.26,null,{"$f":"INDEX(Integrale!$H$3:$H$502,MATCH('NGC7793'!D17,Integrale!$H$3:$H$502,1))","v":0.04},{"$f":"INDEX(Integrale!$I$3:$I$502,MATCH('NGC7793'!D17,Integrale!$H$3:$H$502,1))","v":2.19098e-05},{"$f":"INDEX(Integrale!$H$3:$H$502,MATCH('NGC7793'!D17,Integrale!$H$3:$H$502,1)+1)","v":0.05},{"$f":"INDEX(Integrale!$I$3:$I$502,MATCH('NGC7793'!D17,Integrale!$H$3:$H$502,1)+1)","v":4.22345e-05},0.5844155844155845,0.4155844155844155]
[0.21,24.8,6.4,0.05454545454545454,5.5924727272727266E-5,9679921.692653008,14.080106737949608,43.23,null,{"$f":"INDEX(Integrale!$H$3:$H$502,MATCH('NGC7793'!D18,Integrale!$H$3:$H$502,1))","v":0.05},{"$f":"INDEX(Integrale!$I$3:$I$502,MATCH('NGC7793'!D18,Integrale!$H$3:$H$502,1))","v":4.22345e-05},{"$f":"INDEX(Integrale!$H$3:$H$502,MATCH('NGC7793'!D18,Integrale!$H$3:$H$502,1)+1)","v":0.06},{"$f":"INDEX(Integrale!$I$3:$I$502,MATCH('NGC7793'!D18,Integrale!$H$3:$H$502,1)+1)","v":7.2353e-05},0.5454545454545457,0.45454545454545425]
[0.24,30,7.2,0.06233766233766233,8.21168779220779e-05,14213479.201328196,15.959682627508665,46.8,null,{"$f":"INDEX(Integrale!$H$3:$H$502,MATCH('NGC7793'!D19,Integrale!$H$3:$H$502,1))","v":0.06},{"$f":"INDEX(Integrale!$I$3:$I$502,MATCH('NGC7793'!D19,Integrale!$H$3:$H$502,1))","v":7.2353e-05},{"$f":"INDEX(Integrale!$H$3:$H$502,MATCH('NGC7793'!D19,Integrale!$H$3:$H$502,1)+1)","v":0.07},{"$f":"INDEX(Integrale!$I$3:$I$502,MATCH('NGC7793'!D19,Integrale!$H$3:$H$502,1)+1)","v":0.0001141207},0.7662337662337669,0.2337662337662331]
[0.28,35,7.3,0.07272727272727274,1.2917985454545457E-4,22359534.632511504,18.53241585718008,47.05,null,{"$f":"INDEX(Integrale!$H$3:$H$502,MATCH('NGC7793'!D20,Integrale!$H$3:$H$502,1))","v":0.07},{"$f":"INDEX(Integrale!$I$3:$I$502,MATCH('NGC7793'!D20,Integrale!$H$3:$H$502,1))","v":0.0001141207},{"$f":"INDEX(Integrale!$H$3:$H$502,MATCH('NGC7793'!D20,Integrale!$H$3:$H$502,1)+1)","v":0.08},{"$f":"INDEX(Integrale!$I$3:$I$502,MATCH('NGC7793'!D20,Integrale!$H$3:$H$502,1)+1)","v":1.693376E-4},0.7272727272727267,0.2727272727272732]
[0.32,38.3,7.6,0.08311688311688312,1.9128123636363636E-4,33108563.591991123,21.0947728383712,44.92,null,{"$f":"INDEX(Integrale!$H$3:$H$502,MATCH('NGC7793'!D21,Integrale!$H$3:$H$502,1))","v":0.08},{"$f":"INDEX(Integrale!$I$3:$I$502,MATCH('NGC7793'!D21,Integrale!$H$3:$H$502,1))","v":1.693376E-4},{"$f":"INDEX(Integrale!$H$3:$H$502,MATCH('NGC7793'!D21,Integrale!$H$3:$H$502,1)+1)","v":0.09},{"$f":"INDEX(Integrale!$I$3:$I$502,MATCH('NGC7793'!D21,Integrale!$H$3:$H$502,1)+1)","v":0.0002397401},0.6883116883116883,0.3116883116883117]
[0.35,42.7,8.8,{"$f":"A22/$C$12","v":0.0909090909090909},{"$f":"N22*K22+O22*M22","v":2.4767221818181809E-4},{"$f":"4*$H$12*$E$12*POWER($C$12,3)*E22","v":42869188.53898157},{"$f":"POWER($I$8*F22/A22,0.5)","v":22.951880905637957},{"$f":"ROUND(ABS((B22-G22)/B22)*100,2)","v":46.25},null,{"$f":"INDEX(Integrale!$H$3:$H$502,MATCH('NGC7793'!D22,Integrale!$H$3:$H$502,1))","v":0.09},{"$f":"INDEX(Integrale!$I$3:$I$502,MATCH('NGC7793'!D22,Integrale!$H$3:$H$502,1))","v":0.0002397401},{"$f":"INDEX(Integrale!$H$3:$H$502,MATCH('NGC7793'!D22,Integrale!$H$3:$H$502,1)+1)","v":0.1},{"$f":"INDEX(Integrale!$I$3:$I$502,MATCH('NGC7793'!D22,Integrale!$H$3:$H$502,1)+1)","v":0.0003269934},{"$f":"(L22-D22)/(L22-J22)","v":0.90909090909091},{"$f":"(D22-J22)/(L22-J22)","v":0.09090909090909002}]
[0.39,47,5.3,0.1012987012987013,3.4071934805194806E-4,58974567.58672545,25.502323560993595,45.74,null,{"$f":"INDEX(Integrale!$H$3:$H$502,MATCH('NGC7793'!D23,Integrale!$H$3:$H$502,1))","v":0.1},{"$f":"INDEX(Integrale!$I$3:$I$502,MATCH('NGC7793'!D23,Integrale!$H$3:$H$502,1))","v":0.0003269934},{"$f":"INDEX(Integrale!$H$3:$H$502,MATCH('NGC7793'!D23,Integrale!$H$3:$H$502,1)+1)","v":0.11},{"$f":"INDEX(Integrale!$I$3:$I$502,MATCH('NGC7793'!D23,Integrale!$H$3:$H$502,1)+1)","v":0.0004326832},0.87012987012987,0.12987012987012997]
[0.42,49.8,5.6,{"$f":"A24/$C$12","v":0.10909090909090909},{"$f":"N24*K24+O24*M24","v":4.230750363636363E-4},{"$f":"4*$H$12*$E$12*POWER($C$12,3)*E24","v":73229382.09684375},{"$f":"POWER($I$8*F24/A24,0.5)","v":27.384052078515445},{"$f":"ROUND(ABS((B24-G24)/B24)*100,2)","v":45.01},null,{"$f":"INDEX(Integrale!$H$3:$H$502,MATCH('NGC7793'!D24,Integrale!$H$3:$H$502,1))","v":0.1},{"$f":"INDEX(Integrale!$I$3:$I$502,MATCH('NGC7793'!D24,Integrale!$H$3:$H$502,1))","v":0.0003269934},{"$f":"INDEX(Integrale!$H$3:$H$502,MATCH('NGC7793'!D24,Integrale!$H$3:$H$502,1)+1)","v":0.11},{"$f":"INDEX(Integrale!$I$3:$I$502,MATCH('NGC7793'!D24,Integrale!$H$3:$H$502,1)+1)","v":0.0004326832},{"$f":"(L24-D24)/(L24-J24)","v":0.09090909090909154},{"$f":"(D24-J24)/(L24-J24)","v":0.9090909090909085}]
[0.46,52.2,6.2,0.11948051948051948,5.5178355324675323E-4,95507333.64643781,29.882650604160894,42.75,null,{"$f":"INDEX(Integrale!$H$3:$H$502,MATCH('NGC7793'!D25,Integrale!$H$3:$H$502,1))","v":0.11},{"$f":"INDEX(Integrale!$I$3:$I$502,MATCH('NGC7793'!D25,Integrale!$H$3:$H$502,1))","v":0.0004326832},{"$f":"INDEX(Integrale!$H$3:$H$502,MATCH('NGC7793'!D25,Integrale!$H$3:$H$502,1)+1)","v":0.12},{"$f":"INDEX(Integrale!$I$3:$I$502,MATCH('NGC7793'!D25,Integrale!$H$3:$H$502,1)+1)","v":0.0005583096},0.051948051948051716,0.9480519480519483]
[0.49,53.4,6.3,0.12727272727272726,6.6519752727272707E-4,115137977.20899282,31.790029439938518,40.47,null,{"$f":"INDEX(Integrale!$H$3:$H$502,MATCH('NGC7793'!D26,Integrale!$H$3:$H$502,1))","v":0.12},{"$f":"INDEX(Integrale!$I$3:$I$502,MATCH('NGC7793'!D26,Integrale!$H$3:$H$502,1))","v":0.0005583096},{"$f":"INDEX(Integrale!$H$3:$H$502,MATCH('NGC7793'!D26,Integrale!$H$3:$H$502,1)+1)","v":0.13},{"$f":"INDEX(Integrale!$I$3:$I$502,MATCH('NGC7793'!D26,Integrale!$H$3:$H$502,1)+1)","v":0.0007052805},0.27272727272727426,0.7272727272727257]
[0.53,54.6,5.9,0.13766233766233765,8.3525290259740229E-4,144572590.42632604,34.25190406949679,37.27,null,{"$f":"INDEX(Integrale!$H$3:$H$502,MATCH('NGC7793'!D27,Integrale!$H$3:$H$502,1))","v":0.13},{"$f":"INDEX(Integrale!$I$3:$I$502,MATCH('NGC7793'!D27,Integrale!$H$3:$H$502,1))","v":0.0007052805},{"$f":"INDEX(Integrale!$H$3:$H$502,MATCH('NGC7793'!D27,Integrale!$H$3:$H$502,1)+1)","v":0.14},{"$f":"INDEX(Integrale!$I$3:$I$502,MATCH('NGC7793'!D27,Integrale!$H$3:$H$502,1)+1)","v":0.0008749055},0.23376623376623587,0.7662337662337642]
[0.56,55.5,6.9,{"$f":"A28/$C$12","v":0.14545454545454548},{"$f":"N28*K28+O28*M28","v":9.8044282727272752E-4},{"$f":"4*$H$12*$E$12*POWER($C$12,3)*E28","v":169703282.51831448},{"$f":"POWER($I$8*F28/A28,0.5)","v":36.10195997308523},{"$f":"ROUND(ABS((B28-G28)/B28)*100,2)","v":34.95},null,{"$f":"INDEX(Integrale!$H$3:$H$502,MATCH('NGC7793'!D28,Integrale!$H$3:$H$502,1))","v":0.14},{"$f":"INDEX(Integrale!$I$3:$I$502,MATCH('NGC7793'!D28,Integrale!$H$3:$H$502,1))","v":0.0008749055},{"$f":"INDEX(Integrale!$H$3:$H$502,MATCH('NGC7793'!D28,Integrale!$H$3:$H$502,1)+1)","v":0.15},{"$f":"INDEX(Integrale!$I$3:$I$502,MATCH('NGC7793'!D28,Integrale!$H$3:$H$502,1)+1)","v":1.0683906E-3},{"$f":"(L28-D28)/(L28-J28)","v":0.45454545454545275},{"$f":"(D28-J28)/(L28-J28)","v":0.5454545454545472}]
[0.6,55.9,7.5,0.15584415584415584,1.1960523272727271E-3,207022786.39383662,38.52238098390017,31.09,null,{"$f":"INDEX(Integrale!$H$3:$H$502,MATCH('NGC7793'!D29,Integrale!$H$3:$H$502,1))","v":0.15},{"$f":"INDEX(Integrale!$I$3:$I$502,MATCH('NGC7793'!D29,Integrale!$H$3:$H$502,1))","v":1.0683906E-3},{"$f":"INDEX(Integrale!$H$3:$H$502,MATCH('NGC7793'!D29,Integrale!$H$3:$H$502,1)+1)","v":0.16},{"$f":"INDEX(Integrale!$I$3:$I$502,MATCH('NGC7793'!D29,Integrale!$H$3:$H$502,1)+1)","v":0.001286834},0.4155844155844159,0.584415584415584]
[0.63,58.3,7.4,0.16363636363636364,1.3757023636363633E-3,238118124.16100565,40.318616760335125,30.84,null,{"$f":"INDEX(Integrale!$H$3:$H$502,MATCH('NGC7793'!D30,Integrale!$H$3:$H$502,1))","v":0.16},{"$f":"INDEX(Integrale!$I$3:$I$502,MATCH('NGC7793'!D30,Integrale!$H$3:$H$502,1))","v":0.001286834},{"$f":"INDEX(Integrale!$H$3:$H$502,MATCH('NGC7793'!D30,Integrale!$H$3:$H$502,1)+1)","v":0.17},{"$f":"INDEX(Integrale!$I$3:$I$502,MATCH('NGC7793'!D30,Integrale!$H$3:$H$502,1)+1)","v":0.001531222},0.6363636363636371,0.36363636363636287]
[0.66,59.3,6.3,0.17142857142857143,1.5699653571428572E-3,271742795.3328981,42.081065137445265,29.04,null,{"$f":"INDEX(Integrale!$H$3:$H$502,MATCH('NGC7793'!D31,Integrale!$H$3:$H$502,1))","v":0.17},{"$f":"INDEX(Integrale!$I$3:$I$502,MATCH('NGC7793'!D31,Integrale!$H$3:$H$502,1))","v":0.001531222},{"$f":"INDEX(Integrale!$H$3:$H$502,MATCH('NGC7793'!D31,Integrale!$H$3:$H$502,1)+1)","v":0.18},{"$f":"INDEX(Integrale!$I$3:$I$502,MATCH('NGC7793'!D31,Integrale!$H$3:$H$502,1)+1)","v":1.8024255E-3},0.857142857142858,0.14285714285714207]
[0.7,59.5,6.7,0.1818181818181818,1.856747663636363E-3,321381486.57152903,44.43662639238507,25.32,null,{"$f":"INDEX(Integrale!$H$3:$H$502,MATCH('NGC7793'!D32,Integrale!$H$3:$H$502,1))","v":0.18},{"$f":"INDEX(Integrale!$I$3:$I$502,MATCH('NGC7793'!D32,Integrale!$H$3:$H$502,1))","v":1.8024255E-3},{"$f":"INDEX(Integrale!$H$3:$H$502,MATCH('NGC7793'!D32,Integrale!$H$3:$H$502,1)+1)","v":0.19},{"$f":"INDEX(Integrale!$I$3:$I$502,MATCH('NGC7793'!D32,Integrale!$H$3:$H$502,1)+1)","v":0.0021011974},0.8181818181818199,0.18181818181818005]
[0.87,59.1,5.1,0.22597402597402597,3.4160713103896095E-3,591282325.2553589,54.065160268115186,8.52,null,{"$f":"INDEX(Integrale!$H$3:$H$502,MATCH('NGC7793'!D33,Integrale!$H$3:$H$502,1))","v":0.22},{"$f":"INDEX(Integrale!$I$3:$I$502,MATCH('NGC7793'!D33,Integrale!$H$3:$H$502,1))","v":0.0031686489},{"$f":"INDEX(Integrale!$H$3:$H$502,MATCH('NGC7793'!D33,Integrale!$H$3:$H$502,1)+1)","v":0.23},{"$f":"INDEX(Integrale!$I$3:$I$502,MATCH('NGC7793'!D33,Integrale!$H$3:$H$502,1)+1)","v":0.0035828125},0.40259740259740406,0.5974025974025959]
[1.05,62.6,5.5,0.2727272727272727,0.00568733507272727,984411741.0783794,63.49995468467826,1.44,null,{"$f":"INDEX(Integrale!$H$3:$H$502,MATCH('NGC7793'!D34,Integrale!$H$3:$H$502,1))","v":0.27},{"$f":"INDEX(Integrale!$I$3:$I$502,MATCH('NGC7793'!D34,Integrale!$H$3:$H$502,1))","v":5.5343666E-3},{"$f":"INDEX(Integrale!$H$3:$H$502,MATCH('NGC7793'!D34,Integrale!$H$3:$H$502,1)+1)","v":0.28},{"$f":"INDEX(Integrale!$I$3:$I$502,MATCH('NGC7793'!D34,Integrale!$H$3:$H$502,1)+1)","v":0.006095251},0.7272727272727313,0.2727272727272687]
[1.22,65.6,4.8,0.3168831168831169,0.008408878692207791,1455479377.9617546,71.63129214015768,9.19,null,{"$f":"INDEX(Integrale!$H$3:$H$502,MATCH('NGC7793'!D35,Integrale!$H$3:$H$502,1))","v":0.31},{"$f":"INDEX(Integrale!$I$3:$I$502,MATCH('NGC7793'!D35,Integrale!$H$3:$H$502,1))","v":0.0079467677},{"$f":"INDEX(Integrale!$H$3:$H$502,MATCH('NGC7793'!D35,Integrale!$H$3:$H$502,1)+1)","v":0.32},{"$f":"INDEX(Integrale!$I$3:$I$502,MATCH('NGC7793'!D35,Integrale!$H$3:$H$502,1)+1)","v":0.0086181365},0.3116883116883126,0.6883116883116873]
[1.4,70.7,4.6,0.3636363636363636,0.011839980545454543,2049363315.8659453,79.34601747683482,12.23,null,{"$f":"INDEX(Integrale!$H$3:$H$502,MATCH('NGC7793'!D36,Integrale!$H$3:$H$502,1))","v":0.36},{"$f":"INDEX(Integrale!$I$3:$I$502,MATCH('NGC7793'!D36,Integrale!$H$3:$H$502,1))","v":0.0115524392},{"$f":"INDEX(Integrale!$H$3:$H$502,MATCH('NGC7793'!D36,Integrale!$H$3:$H$502,1)+1)","v":0.37},{"$f":"INDEX(Integrale!$I$3:$I$502,MATCH('NGC7793'!D36,Integrale!$H$3:$H$502,1)+1)","v":0.0123431779},0.6363636363636399,0.3636363636363601]
[1.57,73.9,4,0.4077922077922078,0.01550867416753247,2684371633.436558,85.75336415471861,16.04,null,{"$f":"INDEX(Integrale!$H$3:$H$502,MATCH('NGC7793'!D37,Integrale!$H$3:$H$502,1))","v":0.4},{"$f":"INDEX(Integrale!$I$3:$I$502,MATCH('NGC7793'!D37,Integrale!$H$3:$H$502,1))","v":0.0148341297},{"$f":"INDEX(Integrale!$H$3:$H$502,MATCH('NGC7793'!D37,Integrale!$H$3:$H$502,1)+1)","v":0.41},{"$f":"INDEX(Integrale!$I$3:$I$502,MATCH('NGC7793'!D37,Integrale!$H$3:$H$502,1)+1)","v":0.0156997951},0.22077922077921688,0.7792207792207831]
[1.75,78.5,4.2,0.45454545454545453,0.019725609418181814,3414274218.5704894,91.60303172353387,16.69,null,{"$f":"INDEX(Integrale!$H$3:$H$502,MATCH('NGC7793'!D38,Integrale!$H$3:$H$502,1))","v":0.45},{"$f":"INDEX(Integrale!$I$3:$I$502,MATCH('NGC7793'!D38,Integrale!$H$3:$H$502,1))","v":0.0193032886},{"$f":"INDEX(Integrale!$H$3:$H$502,MATCH('NGC7793'!D38,Integrale!$H$3:$H$502,1)+1)","v":0.46},{"$f":"INDEX(Integrale!$I$3:$I$502,MATCH('NGC7793'!D38,Integrale!$H$3:$H$502,1)+1)","v":0.0202323944},0.5454545454545485,0.45454545454545153]
[1.92,82.4,4.6,0.49870129870129865,0.02389549739350649,4136033465.985945,96.25450837346895,16.81,null,{"$f":"INDEX(Integrale!$H$3:$H$502,MATCH('NGC7793'!D39,Integrale!$H$3:$H$502,1))","v":0.49},{"$f":"INDEX(Integrale!$I$3:$I$502,MATCH('NGC7793'!D39,Integrale!$H$3:$H$502,1))","v":0.0230649017},{"$f":"INDEX(Integrale!$H$3:$H$502,MATCH('NGC7793'!D39,Integrale!$H$3:$H$502,1)+1)","v":0.5},{"$f":"INDEX(Integrale!$I$3:$I$502,MATCH('NGC7793'!D39,Integrale!$H$3:$H$502,1)+1)","v":0.0240194669},0.12987012987013535,0.8701298701298646]
[2.1,87.1,4.9,0.5454545454545454,0.02837486351818181,4911359791.819008,100.2930642064601,15.15,null,{"$f":"INDEX(Integrale!$H$3:$H$502,MATCH('NGC7793'!D40,Integrale!$H$3:$H$502,1))","v":0.54},{"$f":"INDEX(Integrale!$I$3:$I$502,MATCH('NGC7793'!D40,Integrale!$H$3:$H$502,1))","v":0.0278534477},{"$f":"INDEX(Integrale!$H$3:$H$502,MATCH('NGC7793'!D40,Integrale!$H$3:$H$502,1)+1)","v":0.55},{"$f":"INDEX(Integrale!$I$3:$I$502,MATCH('NGC7793'!D40,Integrale!$H$3:$H$502,1)+1)","v":0.0288093767},0.45454545454546263,0.5454545454545374]
[2.27,89.6,5.4,0.5896103896103896,0.03255016407922078,5634055895.0480585,103.31831613467213,15.31,null,{"$f":"INDEX(Integrale!$H$3:$H$502,MATCH('NGC7793'!D41,Integrale!$H$3:$H$502,1))","v":0.58},{"$f":"INDEX(Integrale!$I$3:$I$502,MATCH('NGC7793'!D41,Integrale!$H$3:$H$502,1))","v":0.0316515125},{"$f":"INDEX(Integrale!$H$3:$H$502,MATCH('NGC7793'!D41,Integrale!$H$3:$H$502,1)+1)","v":0.59},{"$f":"INDEX(Integrale!$I$3:$I$502,MATCH('NGC7793'!D41,Integrale!$H$3:$H$502,1)+1)","v":0.0325865959},0.038961038961038384,0.9610389610389616]
[2.45,94.9,5.7,0.6363636363636364,0.03680240652727273,6370069746.570067,105.74716278921461,11.43,null,{"$f":"INDEX(Integrale!$H$3:$H$502,MATCH('NGC7793'!D42,Integrale!$H$3:$H$502,1))","v":0.63},{"$f":"INDEX(Integrale!$I$3:$I$502,MATCH('NGC7793'!D42,Integrale!$H$3:$H$502,1))","v":0.0362383877},{"$f":"INDEX(Integrale!$H$3:$H$502,MATCH('NGC7793'!D42,Integrale!$H$3:$H$502,1)+1)","v":0.64},{"$f":"INDEX(Integrale!$I$3:$I$502,MATCH('NGC7793'!D42,Integrale!$H$3:$H$502,1)+1)","v":0.037124703},0.36363636363636564,0.6363636363636344]
[2.62,98.1,5,0.6805194805194805,0.04058299148571428,7024445156.782978,107.3828781019985,9.46,null,{"$f":"INDEX(Integrale!$H$3:$H$502,MATCH('NGC7793'!D43,Integrale!$H$3:$H$502,1))","v":0.68},{"$f":"INDEX(Integrale!$I$3:$I$502,MATCH('NGC7793'!D43,Integrale!$H$3:$H$502,1))","v":0.040540476},{"$f":"INDEX(Integrale!$H$3:$H$502,MATCH('NGC7793'!D43,Integrale!$H$3:$H$502,1)+1)","v":0.69},{"$f":"INDEX(Integrale!$I$3:$I$502,MATCH('NGC7793'!D43,Integrale!$H$3:$H$502,1)+1)","v":0.0413588991},0.9480519480519519,0.05194805194804805]
[2.79,99.3,5.7,0.7246753246753247,0.04407368714935066,7628644092.1144285,108.44293112192054,9.21,null,{"$f":"INDEX(Integrale!$H$3:$H$502,MATCH('NGC7793'!D44,Integrale!$H$3:$H$502,1))","v":0.72},{"$f":"INDEX(Integrale!$I$3:$I$502,MATCH('NGC7793'!D44,Integrale!$H$3:$H$502,1))","v":0.0437207705},{"$f":"INDEX(Integrale!$H$3:$H$502,MATCH('NGC7793'!D44,Integrale!$H$3:$H$502,1)+1)","v":0.73},{"$f":"INDEX(Integrale!$I$3:$I$502,MATCH('NGC7793'!D44,Integrale!$H$3:$H$502,1)+1)","v":0.04447562},0.5324675324675283,0.46753246753247174]
[2.97,98.6,7.2,0.7714285714285715,0.04742086035714286,8208000954.869759,109.02350672733087,10.57,null,{"$f":"INDEX(Integrale!$H$3:$H$502,MATCH('NGC7793'!D45,Integrale!$H$3:$H$502,1))","v":0.77},{"$f":"INDEX(Integrale!$I$3:$I$502,MATCH('NGC7793'!D45,Integrale!$H$3:$H$502,1))","v":0.0473252771},{"$f":"INDEX(Integrale!$H$3:$H$502,MATCH('NGC7793'!D45,Integrale!$H$3:$H$502,1)+1)","v":0.78},{"$f":"INDEX(Integrale!$I$3:$I$502,MATCH('NGC7793'!D45,Integrale!$H$3:$H$502,1)+1)","v":0.0479943599},0.8571428571428555,0.14285714285714443]
[3.16,101,8.7,0.8207792207792208,0.05054040193506494,8747957422.498114,109.11625735770927,8.04,null,{"$f":"INDEX(Integrale!$H$3:$H$502,MATCH('NGC7793'!D46,Integrale!$H$3:$H$502,1))","v":0.82},{"$f":"INDEX(Integrale!$I$3:$I$502,MATCH('NGC7793'!D46,Integrale!$H$3:$H$502,1))","v":0.0504950998},{"$f":"INDEX(Integrale!$H$3:$H$502,MATCH('NGC7793'!D46,Integrale!$H$3:$H$502,1)+1)","v":0.83},{"$f":"INDEX(Integrale!$I$3:$I$502,MATCH('NGC7793'!D46,Integrale!$H$3:$H$502,1)+1)","v":0.0510764772},0.9220779220779122,0.07792207792208787]
[3.33,103,9.4,0.8649350649350649,0.05296998330779221,9168489780.559294,108.81943290672113,5.65,null,{"$f":"INDEX(Integrale!$H$3:$H$502,MATCH('NGC7793'!D47,Integrale!$H$3:$H$502,1))","v":0.86},{"$f":"INDEX(Integrale!$I$3:$I$502,MATCH('NGC7793'!D47,Integrale!$H$3:$H$502,1))","v":0.0527169267},{"$f":"INDEX(Integrale!$H$3:$H$502,MATCH('NGC7793'!D47,Integrale!$H$3:$H$502,1)+1)","v":0.87},{"$f":"INDEX(Integrale!$I$3:$I$502,MATCH('NGC7793'!D47,Integrale!$H$3:$H$502,1)+1)","v":0.0532296993},0.5064935064935101,0.4935064935064899]
[3.51,107,9.1,0.9116883116883117,0.05518900112987012,9552576030.056137,108.18981189648191,1.11,null,{"$f":"INDEX(Integrale!$H$3:$H$502,MATCH('NGC7793'!D48,Integrale!$H$3:$H$502,1))","v":0.91},{"$f":"INDEX(Integrale!$I$3:$I$502,MATCH('NGC7793'!D48,Integrale!$H$3:$H$502,1))","v":0.0551161169},{"$f":"INDEX(Integrale!$H$3:$H$502,MATCH('NGC7793'!D48,Integrale!$H$3:$H$502,1)+1)","v":0.92},{"$f":"INDEX(Integrale!$I$3:$I$502,MATCH('NGC7793'!D48,Integrale!$H$3:$H$502,1)+1)","v":0.0555478158},0.8311688311688373,0.16883116883116264]
[3.68,114,7.4,0.9558441558441558,0.05696912621428571,9860695036.8103,107.35184847315188,5.83,null,{"$f":"INDEX(Integrale!$H$3:$H$502,MATCH('NGC7793'!D49,Integrale!$H$3:$H$502,1))","v":0.95},{"$f":"INDEX(Integrale!$I$3:$I$502,MATCH('NGC7793'!D49,Integrale!$H$3:$H$502,1))","v":0.0567517415},{"$f":"INDEX(Integrale!$H$3:$H$502,MATCH('NGC7793'!D49,Integrale!$H$3:$H$502,1)+1)","v":0.96},{"$f":"INDEX(Integrale!$I$3:$I$502,MATCH('NGC7793'!D49,Integrale!$H$3:$H$502,1)+1)","v":0.0571237109},0.4155844155844131,0.5844155844155868]
[3.85,112,8.1,{"$f":"A50/$C$12","v":1},{"$f":"N50*K50+O50*M50","v":0.0584738086},{"$f":"4*$H$12*$E$12*POWER($C$12,3)*E50","v":10121138106.921286},{"$f":"POWER($I$8*F50/A50,0.5)","v":106.33200014858848},{"$f":"ROUND(ABS((B50-G50)/B50)*100,2)","v":5.06},null,{"$f":"INDEX(Integrale!$H$3:$H$502,MATCH('NGC7793'!D50,Integrale!$H$3:$H$502,1))","v":1},{"$f":"INDEX(Integrale!$I$3:$I$502,MATCH('NGC7793'!D50,Integrale!$H$3:$H$502,1))","v":0.0584738086},{"$f":"INDEX(Integrale!$H$3:$H$502,MATCH('NGC7793'!D50,Integrale!$H$3:$H$502,1)+1)","v":1.01},{"$f":"INDEX(Integrale!$I$3:$I$502,MATCH('NGC7793'!D50,Integrale!$H$3:$H$502,1)+1)","v":0.0587786248},{"$f":"(L50-D50)/(L50-J50)","v":1},{"$f":"(D50-J50)/(L50-J50)","v":0}]
[{"$nulls":6},"Erreur moy",{"$f":"ROUND(AVERAGE(H15:H50),2)","v":24.18}]
[null,"Précision=",{"$f":"ROUND(MAX(0,100-H51),2)","v":75.82},"%"]
[]
["R","V_Obs","Incer V_Obs","V_TURI","A=(V_obs-V_TURI)^2","A/Incer V_Obs^2"]
[{"$f":"A15","v":0.11},{"$f":"B15","v":9.1},{"$f":"C15","v":8.5},{"$f":"ROUND(G15,2)","v":7.61},{"$f":"ROUND(POWER((B55-D55),2),2)","v":2.22},{"$f":"ROUND(E55/POWER(C55,2),2)","v":0.03},1]
[{"$f":"A16","v":0.14},{"$f":"B16","v":17.6},{"$f":"C16","v":7.4},9.62,{"$f":"ROUND(POWER((B56-D56),2),2)","v":63.68},{"$f":"ROUND(E56/POWER(C56,2),2)","v":1.16},{"$f":"1+G55","v":2}]
[{"$f":"A17","v":0.17},{"$f":"B17","v":19.3},{"$f":"C17","v":7.4},11.53,{"$f":"ROUND(POWER((B57-D57),2),2)","v":60.37},{"$f":"ROUND(E57/POWER(C57,2),2)","v":1.1},{"$f":"1+G56","v":3}]
[{"$f":"A18","v":0.21},{"$f":"B18","v":24.8},{"$f":"C18","v":6.4},14.08,{"$f":"ROUND(POWER((B58-D58),2),2)","v":114.92},{"$f":"ROUND(E58/POWER(C58,2),2)","v":2.81},4]
[{"$f":"A19","v":0.24},{"$f":"B19","v":30},{"$f":"C19","v":7.2},15.96,{"$f":"ROUND(POWER((B59-D59),2),2)","v":197.12},{"$f":"ROUND(E59/POWER(C59,2),2)","v":3.8},5]
[{"$f":"A20","v":0.28},{"$f":"B20","v":35},{"$f":"C20","v":7.3},18.53,{"$f":"ROUND(POWER((B60-D60),2),2)","v":271.26},{"$f":"ROUND(E60/POWER(C60,2),2)","v":5.09},6]
{"$rows_left_out":32}
{"sheet":"Integrale","index":1,"n_rows":372,"n_cols":9,"rows_kept":372}
[{"$nulls":7},"u","I(u) = Integrale de 0 à u de ( x^2sech^8(x)dx"]
[{"$nulls":7},0,0]
[{"$nulls":7},0.01,4.998e-07]
[{"$nulls":7},0.02,2.9964e-06]
[{"$nulls":7},0.03,9.477e-06]
[{"$nulls":7},0.04,2.19098e-05]
[{"$nulls":7},0.05,4.22345e-05]
[{"$nulls":7},0.06,7.2353e-05]
[{"$nulls":7},0.07,0.0001141207]
[{"$nulls":7},0.08,1.693376E-4]
[{"$nulls":7},0.09,0.0002397401]
[{"$nulls":7},0.1,0.0003269934]
[{"$nulls":7},0.11,0.0004326832]
[{"$nulls":7},0.12,0.0005583096]
[{"$nulls":7},0.13,0.0007052805]
[{"$nulls":7},0.14,0.0008749055]
[{"$nulls":7},0.15,1.0683906E-3]
[{"$nulls":7},0.16,0.001286834]
[{"$nulls":7},0.17,0.001531222]
[{"$nulls":7},0.18,1.8024255E-3]
[{"$nulls":7},0.19,0.0021011974]
[{"$nulls":7},0.2,0.0024281708]
[{"$nulls":7},0.21,0.0027838579]
[{"$nulls":7},0.22,0.0031686489]
[{"$nulls":7},0.23,0.0035828125]
[{"$nulls":7},0.24,0.0040264964]
[{"$nulls":7},0.25,4.4997288E-3]
[{"$nulls":7},0.26,0.0050024204]
[{"$nulls":7},0.27,5.5343666E-3]
[{"$nulls":7},0.28,0.006095251]
[{"$nulls":7},0.29,0.0066846487]
[{"$nulls":7},0.3,0.0073020305]
[{"$nulls":7},0.31,0.0079467677]
[{"$nulls":7},0.32,0.0086181365]
[{"$nulls":7},0.33,0.0093153237]
[{"$nulls":7},0.34,0.010037432]
[{"$nulls":7},0.35,0.0107834863]
[{"$nulls":7},0.36,0.0115524392]
[{"$nulls":7},0.37,0.0123431779]
[{"$nulls":7},0.38,0.0131545302]
[{"$nulls":7},0.39,0.0139852712]
[{"$nulls":7},0.4,0.0148341297]
[{"$nulls":7},0.41,0.0156997951]
[{"$nulls":7},0.42,0.0165809236]
[{"$nulls":7},0.43,0.0174761447]
[{"$nulls":7},0.44,0.0183840679]
[{"$nulls":7},0.45,0.0193032886]
[{"$nulls":7},0.46,0.0202323944]
[{"$nulls":7},0.47,0.0211699709]
[{"$nulls":7},0.48,0.0221146072]
[{"$nulls":7},0.49,0.0230649017]
[{"$nulls":7},0.5,0.0240194669]
[{"$nulls":7},0.51,0.0249769344]
[{"$nulls":7},0.52,0.0259359595]
[{"$nulls":7},0.53,0.0268952255]
[{"$nulls":7},0.54,0.0278534477]
[{"$nulls":7},0.55,0.0288093767]
[{"$nulls":7},0.56,0.0297618021]
[{"$nulls":7},0.57,0.0307095554]
[{"$nulls":7},0.58,0.0316515125]
{"$rows_left_out":313}
{"sheet":"Feuil3","index":2,"n_rows":0,"n_cols":0,"rows_kept":0}