{"text_format":"3","workbook":"xlsx","n_sheets":3,"sheets":["NGC0289","Integrale","Feuil3"],"not_rendered":{"charts":1},"read":"whole","date_system":"1900"}

{"sheet":"NGC0289","index":0,"n_rows":75,"n_cols":15,"rows_kept":75,"merged":[[9,2,9,3],[13,9,13,14]]}
[]
[]
[null,"ρ(r) = ρ0sech^8( r/ r_c)"]
[]
[]
["M(R) =4πρ0,r_c^3 ·I(u)",null,"u = R/r_c","I(u) = Integrale de 0 à u de ( x^2sech^8(x)dx",{"$nulls":3},"V_TURI(R) = Racine (G·M(R)/R)"]
[]
[{"$nulls":7},"G=",{"$f":"4.3009*POWER(10,-6)","v":4.3009000000000006E-6},"10^-6,KPC,(Km/s)^2/Mo"]
["NGC0289","R_max=",{"$f":"A42","v":71.12},"V_obs(R_max)=",{"$f":"B42","v":165}]
[null,"M_totale=","V_obs^2(R_max).R_max/G=",null,{"$f":"E9*E9*C9/I8","v":450194610430.375},"Mo","I(infini)=",0.0648738184]
[{"$nulls":6},"M(R) = racine(G,M(R)/R)"]
[null,"r_c=R_max/2=",{"$f":"C9/2","v":35.56},"ρ0=M_tot/4.π.r_c^3.I(infini)=",{"$f":"E10/(POWER(C12,3)*4*3.14159*H10)","v":12281066.319561077},"Mo/kpc^3","π=",3.14159]
[]
["R","V_obs","Incer V_obs","u=R/r-c","I(U) par table","M(R) ","V_TURI","Erreur %",null,"calculs intermediaires de I(u)"]
[1.5,164,28.2,{"$f":"A15/$C$12","v":0.0421822272215973},{"$f":"N15*K15+O15*M15","v":2.6345111361079862E-5},{"$f":"4*$H$12*$E$12*POWER($C$12,3)*E15","v":182823016.10207355},{"$f":"POWER($I$8*F15/A15,0.5)","v":22.895465489239104},{"$f":"ROUND(ABS((B15-G15)/B15)*100,2)","v":86.04},1,{"$f":"INDEX(Integrale!$H$3:$H$502,MATCH('NGC0289'!D15,Integrale!$H$3:$H$502,1))","v":0.04},{"$f":"INDEX(Integrale!$I$3:$I$502,MATCH('NGC0289'!D15,Integrale!$H$3:$H$502,1))","v":2.19098e-05},{"$f":"INDEX(Integrale!$H$3:$H$502,MATCH('NGC0289'!D15,Integrale!$H$3:$H$502,1)+1)","v":0.05},{"$f":"INDEX(Integrale!$I$3:$I$502,MATCH('NGC0289'!D15,Integrale!$H$3:$H$502,1)+1)","v":4.22345e-05},{"$f":"(L15-D15)/(L15-J15)","v":0.7817772778402703},{"$f":"(D15-J15)/(L15-J15)","v":0.21822272215972974}]
[2.52,194,32,{"$f":"A16/$C$12","v":0.07086614173228346},{"$f":"N16*K16+O16*M16","v":1.1890326614173224E-4},{"$f":"4*$H$12*$E$12*POWER($C$12,3)*E16","v":825134251.3789252},37.52681528955048,80.66,{"$f":"I15+1","v":2},{"$f":"INDEX(Integrale!$H$3:$H$502,MATCH('NGC0289'!D16,Integrale!$H$3:$H$502,1))","v":0.07},{"$f":"INDEX(Integrale!$I$3:$I$502,MATCH('NGC0289'!D16,Integrale!$H$3:$H$502,1))","v":0.0001141207},{"$f":"INDEX(Integrale!$H$3:$H$502,MATCH('NGC0289'!D16,Integrale!$H$3:$H$502,1)+1)","v":0.08},{"$f":"INDEX(Integrale!$I$3:$I$502,MATCH('NGC0289'!D16,Integrale!$H$3:$H$502,1)+1)","v":1.693376E-4},{"$f":"(L16-D16)/(L16-J16)","v":0.9133858267716543},0.08661417322834573]
[3.46,175,25.2,0.09730033745781777,3.034379534308211E-4,2105720529.540755,51.16134917092169,70.76,{"$f":"I16+1","v":3},{"$f":"INDEX(Integrale!$H$3:$H$502,MATCH('NGC0289'!D17,Integrale!$H$3:$H$502,1))","v":0.09},{"$f":"INDEX(Integrale!$I$3:$I$502,MATCH('NGC0289'!D17,Integrale!$H$3:$H$502,1))","v":0.0002397401},{"$f":"INDEX(Integrale!$H$3:$H$502,MATCH('NGC0289'!D17,Integrale!$H$3:$H$502,1)+1)","v":0.1},{"$f":"INDEX(Integrale!$I$3:$I$502,MATCH('NGC0289'!D17,Integrale!$H$3:$H$502,1)+1)","v":0.0003269934},0.2699662542182233,0.7300337457817767]
[4.32,185,31.5,0.12148481439820022,5.8013205084364442E-4,4025850937.5444593,63.30917356674981,65.78,4,{"$f":"INDEX(Integrale!$H$3:$H$502,MATCH('NGC0289'!D18,Integrale!$H$3:$H$502,1))","v":0.12},{"$f":"INDEX(Integrale!$I$3:$I$502,MATCH('NGC0289'!D18,Integrale!$H$3:$H$502,1))","v":0.0005583096},{"$f":"INDEX(Integrale!$H$3:$H$502,MATCH('NGC0289'!D18,Integrale!$H$3:$H$502,1)+1)","v":0.13},{"$f":"INDEX(Integrale!$I$3:$I$502,MATCH('NGC0289'!D18,Integrale!$H$3:$H$502,1)+1)","v":0.0007052805},0.8515185601799777,0.14848143982002224]
[5.43,175,27.9,0.1526996625421822,1.1273629464566923E-3,7823382914.881889,78.71854375241006,55.02,5,{"$f":"INDEX(Integrale!$H$3:$H$502,MATCH('NGC0289'!D19,Integrale!$H$3:$H$502,1))","v":0.15},{"$f":"INDEX(Integrale!$I$3:$I$502,MATCH('NGC0289'!D19,Integrale!$H$3:$H$502,1))","v":1.0683906E-3},{"$f":"INDEX(Integrale!$H$3:$H$502,MATCH('NGC0289'!D19,Integrale!$H$3:$H$502,1)+1)","v":0.16},{"$f":"INDEX(Integrale!$I$3:$I$502,MATCH('NGC0289'!D19,Integrale!$H$3:$H$502,1)+1)","v":0.001286834},0.7300337457817795,0.2699662542182205]
[6.38,167,27.2,0.1794150731158605,1.7865620781777275E-3,12397923208.955173,91.42054460784101,45.26,6,{"$f":"INDEX(Integrale!$H$3:$H$502,MATCH('NGC0289'!D20,Integrale!$H$3:$H$502,1))","v":0.17},{"$f":"INDEX(Integrale!$I$3:$I$502,MATCH('NGC0289'!D20,Integrale!$H$3:$H$502,1))","v":0.001531222},{"$f":"INDEX(Integrale!$H$3:$H$502,MATCH('NGC0289'!D20,Integrale!$H$3:$H$502,1)+1)","v":0.18},{"$f":"INDEX(Integrale!$I$3:$I$502,MATCH('NGC0289'!D20,Integrale!$H$3:$H$502,1)+1)","v":1.8024255E-3},0.058492688413949834,0.9415073115860502]
[7.57,176,7.18,0.21287964004499438,2.8946638572553435E-3,20087642437.02905,106.83073523912923,39.3,7,{"$f":"INDEX(Integrale!$H$3:$H$502,MATCH('NGC0289'!D21,Integrale!$H$3:$H$502,1))","v":0.21},{"$f":"INDEX(Integrale!$I$3:$I$502,MATCH('NGC0289'!D21,Integrale!$H$3:$H$502,1))","v":0.0027838579},{"$f":"INDEX(Integrale!$H$3:$H$502,MATCH('NGC0289'!D21,Integrale!$H$3:$H$502,1)+1)","v":0.22},{"$f":"INDEX(Integrale!$I$3:$I$502,MATCH('NGC0289'!D21,Integrale!$H$3:$H$502,1)+1)","v":0.0031686489},0.7120359955005616,0.2879640044994383]
[10.6,185,4.29,0.29808773903262087,0.007183970988188974,49853470939.99405,142.22450800062836,23.12,8,{"$f":"INDEX(Integrale!$H$3:$H$502,MATCH('NGC0289'!D22,Integrale!$H$3:$H$502,1))","v":0.29},{"$f":"INDEX(Integrale!$I$3:$I$502,MATCH('NGC0289'!D22,Integrale!$H$3:$H$502,1))","v":0.0066846487},{"$f":"INDEX(Integrale!$H$3:$H$502,MATCH('NGC0289'!D22,Integrale!$H$3:$H$502,1)+1)","v":0.3},{"$f":"INDEX(Integrale!$I$3:$I$502,MATCH('NGC0289'!D22,Integrale!$H$3:$H$502,1)+1)","v":0.0073020305},0.19122609673791185,0.8087739032620882]
[13.57,183,4.22,0.3816085489313836,0.013288158954780652,92213741868.8519,170.95726892088024,6.58,9,{"$f":"INDEX(Integrale!$H$3:$H$502,MATCH('NGC0289'!D23,Integrale!$H$3:$H$502,1))","v":0.38},{"$f":"INDEX(Integrale!$I$3:$I$502,MATCH('NGC0289'!D23,Integrale!$H$3:$H$502,1))","v":0.0131545302},{"$f":"INDEX(Integrale!$H$3:$H$502,MATCH('NGC0289'!D23,Integrale!$H$3:$H$502,1)+1)","v":0.39},{"$f":"INDEX(Integrale!$I$3:$I$502,MATCH('NGC0289'!D23,Integrale!$H$3:$H$502,1)+1)","v":0.0139852712},0.8391451068616432,0.16085489313835674]
[16.64,172,4.33,0.467941507311586,0.020976971462992124,145570581918.9276,193.9723469485176,12.77,10,{"$f":"INDEX(Integrale!$H$3:$H$502,MATCH('NGC0289'!D24,Integrale!$H$3:$H$502,1))","v":0.46},{"$f":"INDEX(Integrale!$I$3:$I$502,MATCH('NGC0289'!D24,Integrale!$H$3:$H$502,1))","v":0.0202323944},{"$f":"INDEX(Integrale!$H$3:$H$502,MATCH('NGC0289'!D24,Integrale!$H$3:$H$502,1)+1)","v":0.47},{"$f":"INDEX(Integrale!$I$3:$I$502,MATCH('NGC0289'!D24,Integrale!$H$3:$H$502,1)+1)","v":0.0211699709},0.20584926884139695,0.794150731158603]
[19.71,161,4.24,0.5542744656917885,0.02921648766962879,202749053608.54153,210.33704978842275,30.64,11,{"$f":"INDEX(Integrale!$H$3:$H$502,MATCH('NGC0289'!D25,Integrale!$H$3:$H$502,1))","v":0.55},{"$f":"INDEX(Integrale!$I$3:$I$502,MATCH('NGC0289'!D25,Integrale!$H$3:$H$502,1))","v":0.0288093767},{"$f":"INDEX(Integrale!$H$3:$H$502,MATCH('NGC0289'!D25,Integrale!$H$3:$H$502,1)+1)","v":0.56},{"$f":"INDEX(Integrale!$I$3:$I$502,MATCH('NGC0289'!D25,Integrale!$H$3:$H$502,1)+1)","v":0.0297618021},0.5725534308211538,0.4274465691788461]
[22.68,156,5.08,0.6377952755905512,{"$f":"N26*K26+O26*M26","v":0.0369292949023622},256272406065.7016,220.44947583383683,41.31,12,{"$f":"INDEX(Integrale!$H$3:$H$502,MATCH('NGC0289'!D26,Integrale!$H$3:$H$502,1))","v":0.63},{"$f":"INDEX(Integrale!$I$3:$I$502,MATCH('NGC0289'!D26,Integrale!$H$3:$H$502,1))","v":0.0362383877},{"$f":"INDEX(Integrale!$H$3:$H$502,MATCH('NGC0289'!D26,Integrale!$H$3:$H$502,1)+1)","v":0.64},{"$f":"INDEX(Integrale!$I$3:$I$502,MATCH('NGC0289'!D26,Integrale!$H$3:$H$502,1)+1)","v":0.037124703},0.2204724409448853,0.7795275590551147]
[25.75,159,6.49,{"$f":"A27/$C$12","v":0.7241282339707537},{"$f":"N27*K27+O27*M27","v":0.04403239003487064},{"$f":"4*$H$12*$E$12*POWER($C$12,3)*E27","v":305564635579.8122},{"$f":"POWER($I$8*F27/A27,0.5)","v":225.9137167679108},{"$f":"ROUND(ABS((B27-G27)/B27)*100,2)","v":42.08},13,{"$f":"INDEX(Integrale!$H$3:$H$502,MATCH('NGC0289'!D27,Integrale!$H$3:$H$502,1))","v":0.72},{"$f":"INDEX(Integrale!$I$3:$I$502,MATCH('NGC0289'!D27,Integrale!$H$3:$H$502,1))","v":0.0437207705},{"$f":"INDEX(Integrale!$H$3:$H$502,MATCH('NGC0289'!D27,Integrale!$H$3:$H$502,1)+1)","v":0.73},{"$f":"INDEX(Integrale!$I$3:$I$502,MATCH('NGC0289'!D27,Integrale!$H$3:$H$502,1)+1)","v":0.04447562},{"$f":"(L27-D27)/(L27-J27)","v":0.5871766029246323},{"$f":"(D27-J27)/(L27-J27)","v":0.4128233970753677}]
[28.72,173,6.97,0.8076490438695162,0.04975134177930258,345251543428.829,227.38157430172467,31.43,14,{"$f":"INDEX(Integrale!$H$3:$H$502,MATCH('NGC0289'!D28,Integrale!$H$3:$H$502,1))","v":0.8},{"$f":"INDEX(Integrale!$I$3:$I$502,MATCH('NGC0289'!D28,Integrale!$H$3:$H$502,1))","v":0.0492798642},{"$f":"INDEX(Integrale!$H$3:$H$502,MATCH('NGC0289'!D28,Integrale!$H$3:$H$502,1)+1)","v":0.81},{"$f":"INDEX(Integrale!$I$3:$I$502,MATCH('NGC0289'!D28,Integrale!$H$3:$H$502,1)+1)","v":0.0498962518},0.2350956130483859,0.7649043869516141]
[31.79,177,6.57,0.8939820022497187,0.054389874793363324,377440839738.74854,225.97419782394687,27.67,15,{"$f":"INDEX(Integrale!$H$3:$H$502,MATCH('NGC0289'!D29,Integrale!$H$3:$H$502,1))","v":0.89},{"$f":"INDEX(Integrale!$I$3:$I$502,MATCH('NGC0289'!D29,Integrale!$H$3:$H$502,1))","v":0.0542053641},{"$f":"INDEX(Integrale!$H$3:$H$502,MATCH('NGC0289'!D29,Integrale!$H$3:$H$502,1)+1)","v":0.9},{"$f":"INDEX(Integrale!$I$3:$I$502,MATCH('NGC0289'!D29,Integrale!$H$3:$H$502,1)+1)","v":0.0546687257},0.6017997750281329,0.39820022497186713]
[34.77,179,4.47,0.9777840269966255,0.05774938286006749,400754288255.10077,222.64677878521604,24.38,16,{"$f":"INDEX(Integrale!$H$3:$H$502,MATCH('NGC0289'!D30,Integrale!$H$3:$H$502,1))","v":0.97},{"$f":"INDEX(Integrale!$I$3:$I$502,MATCH('NGC0289'!D30,Integrale!$H$3:$H$502,1))","v":0.0574815594},{"$f":"INDEX(Integrale!$H$3:$H$502,MATCH('NGC0289'!D30,Integrale!$H$3:$H$502,1)+1)","v":0.98},{"$f":"INDEX(Integrale!$I$3:$I$502,MATCH('NGC0289'!D30,Integrale!$H$3:$H$502,1)+1)","v":0.0578256274},0.22159730033745031,0.7784026996625497]
[37.84,181,4.26,1.064116985376828,0.060221278574465686,417908113258.99493,217.94379550674074,20.41,17,{"$f":"INDEX(Integrale!$H$3:$H$502,MATCH('NGC0289'!D31,Integrale!$H$3:$H$502,1))","v":1.06},{"$f":"INDEX(Integrale!$I$3:$I$502,MATCH('NGC0289'!D31,Integrale!$H$3:$H$502,1))","v":0.0601241663},{"$f":"INDEX(Integrale!$H$3:$H$502,MATCH('NGC0289'!D31,Integrale!$H$3:$H$502,1)+1)","v":1.07},{"$f":"INDEX(Integrale!$I$3:$I$502,MATCH('NGC0289'!D31,Integrale!$H$3:$H$502,1)+1)","v":0.0603600483},0.5883014623172084,0.4116985376827916]
[40.81,182,4.26,1.1476377952755905,0.06186759528740157,429332797815.94995,212.71269420299018,16.88,18,{"$f":"INDEX(Integrale!$H$3:$H$502,MATCH('NGC0289'!D32,Integrale!$H$3:$H$502,1))","v":1.14},{"$f":"INDEX(Integrale!$I$3:$I$502,MATCH('NGC0289'!D32,Integrale!$H$3:$H$502,1))","v":0.0617429593},{"$f":"INDEX(Integrale!$H$3:$H$502,MATCH('NGC0289'!D32,Integrale!$H$3:$H$502,1)+1)","v":1.15},{"$f":"INDEX(Integrale!$I$3:$I$502,MATCH('NGC0289'!D32,Integrale!$H$3:$H$502,1)+1)","v":0.0619061425},0.2362204724409398,0.7637795275590602]
[43.88,182,4.83,1.2339707536557931,0.06300169400663667,437202923911.31226,207.00836340992038,13.74,19,{"$f":"INDEX(Integrale!$H$3:$H$502,MATCH('NGC0289'!D33,Integrale!$H$3:$H$502,1))","v":1.23},{"$f":"INDEX(Integrale!$I$3:$I$502,MATCH('NGC0289'!D33,Integrale!$H$3:$H$502,1))","v":0.0629602337},{"$f":"INDEX(Integrale!$H$3:$H$502,MATCH('NGC0289'!D33,Integrale!$H$3:$H$502,1)+1)","v":1.24},{"$f":"INDEX(Integrale!$I$3:$I$502,MATCH('NGC0289'!D33,Integrale!$H$3:$H$502,1)+1)","v":0.0630646479},0.6029246344206868,0.3970753655793132]
[46.85,180,5.5,1.3174915635545557,0.0637124312167604,442135114883.28723,201.46628540208565,11.93,20,{"$f":"INDEX(Integrale!$H$3:$H$502,MATCH('NGC0289'!D34,Integrale!$H$3:$H$502,1))","v":1.31},{"$f":"INDEX(Integrale!$I$3:$I$502,MATCH('NGC0289'!D34,Integrale!$H$3:$H$502,1))","v":0.0636611197},{"$f":"INDEX(Integrale!$H$3:$H$502,MATCH('NGC0289'!D34,Integrale!$H$3:$H$502,1)+1)","v":1.32},{"$f":"INDEX(Integrale!$I$3:$I$502,MATCH('NGC0289'!D34,Integrale!$H$3:$H$502,1)+1)","v":0.0637296121},0.2508436445444404,0.7491563554555596]
[49.92,177,8.5,1.403824521934758,0.06417698457367829,445358902579.1533,195.88331863966283,10.67,21,{"$f":"INDEX(Integrale!$H$3:$H$502,MATCH('NGC0289'!D35,Integrale!$H$3:$H$502,1))","v":1.4},{"$f":"INDEX(Integrale!$I$3:$I$502,MATCH('NGC0289'!D35,Integrale!$H$3:$H$502,1))","v":0.064161072},{"$f":"INDEX(Integrale!$H$3:$H$502,MATCH('NGC0289'!D35,Integrale!$H$3:$H$502,1)+1)","v":1.41},{"$f":"INDEX(Integrale!$I$3:$I$502,MATCH('NGC0289'!D35,Integrale!$H$3:$H$502,1)+1)","v":0.0642026787},0.6175478065241874,0.3824521934758126]
[52.99,175,11,1.4901574803149606,0.06446239021181102,447339487092.9484,190.54665552172875,8.88,22,{"$f":"INDEX(Integrale!$H$3:$H$502,MATCH('NGC0289'!D36,Integrale!$H$3:$H$502,1))","v":1.49},{"$f":"INDEX(Integrale!$I$3:$I$502,MATCH('NGC0289'!D36,Integrale!$H$3:$H$502,1))","v":0.0644620009},{"$f":"INDEX(Integrale!$H$3:$H$502,MATCH('NGC0289'!D36,Integrale!$H$3:$H$502,1)+1)","v":1.5},{"$f":"INDEX(Integrale!$I$3:$I$502,MATCH('NGC0289'!D36,Integrale!$H$3:$H$502,1)+1)","v":0.0644867222},0.9842519685039344,0.015748031496065615]
[55.96,172,11.6,1.5736782902137232,0.064629716543982,448500655261.93134,185.66171614417948,7.94,23,{"$f":"INDEX(Integrale!$H$3:$H$502,MATCH('NGC0289'!D37,Integrale!$H$3:$H$502,1))","v":1.57},{"$f":"INDEX(Integrale!$I$3:$I$502,MATCH('NGC0289'!D37,Integrale!$H$3:$H$502,1))","v":0.0646240835},{"$f":"INDEX(Integrale!$H$3:$H$502,MATCH('NGC0289'!D37,Integrale!$H$3:$H$502,1)+1)","v":1.58},{"$f":"INDEX(Integrale!$I$3:$I$502,MATCH('NGC0289'!D37,Integrale!$H$3:$H$502,1)+1)","v":0.0646393978},0.632170978627688,0.367829021372312]
[59.03,168,12.6,1.6600112485939258,0.06473332059426322,449219619956.86847,180.91419284146983,7.69,24,{"$f":"INDEX(Integrale!$H$3:$H$502,MATCH('NGC0289'!D38,Integrale!$H$3:$H$502,1))","v":1.66},{"$f":"INDEX(Integrale!$I$3:$I$502,MATCH('NGC0289'!D38,Integrale!$H$3:$H$502,1))","v":0.0647333107},{"$f":"INDEX(Integrale!$H$3:$H$502,MATCH('NGC0289'!D38,Integrale!$H$3:$H$502,1)+1)","v":1.67},{"$f":"INDEX(Integrale!$I$3:$I$502,MATCH('NGC0289'!D38,Integrale!$H$3:$H$502,1)+1)","v":0.0647421067},0.9988751406074128,1.1248593925872175E-3]
[62,158,5.38,1.7435320584926883,0.06479224141068617,449628503457.9477,176.60815157283193,11.78,25,{"$f":"INDEX(Integrale!$H$3:$H$502,MATCH('NGC0289'!D39,Integrale!$H$3:$H$502,1))","v":1.74},{"$f":"INDEX(Integrale!$I$3:$I$502,MATCH('NGC0289'!D39,Integrale!$H$3:$H$502,1))","v":0.0647903667},{"$f":"INDEX(Integrale!$H$3:$H$502,MATCH('NGC0289'!D39,Integrale!$H$3:$H$502,1)+1)","v":1.75},{"$f":"INDEX(Integrale!$I$3:$I$502,MATCH('NGC0289'!D39,Integrale!$H$3:$H$502,1)+1)","v":0.0647956744},0.6467941507311664,0.3532058492688336]
[65.07,158,6.5,1.8298650168728905,0.06482778240359954,449875141683.56116,172.43890933603652,9.14,26,{"$f":"INDEX(Integrale!$H$3:$H$502,MATCH('NGC0289'!D40,Integrale!$H$3:$H$502,1))","v":1.82},{"$f":"INDEX(Integrale!$I$3:$I$502,MATCH('NGC0289'!D40,Integrale!$H$3:$H$502,1))","v":0.0648246547},{"$f":"INDEX(Integrale!$H$3:$H$502,MATCH('NGC0289'!D40,Integrale!$H$3:$H$502,1)+1)","v":1.83},{"$f":"INDEX(Integrale!$I$3:$I$502,MATCH('NGC0289'!D40,Integrale!$H$3:$H$502,1)+1)","v":0.0648278252},0.013498312710957793,0.9865016872890422]
[68.05,166,15.5,{"$f":"A41/$C$12","v":1.9136670416197974},{"$f":"N41*K41+O41*M41","v":0.064847584535883},{"$f":"4*$H$12*$E$12*POWER($C$12,3)*E41","v":450012559419.235},{"$f":"POWER($I$8*F41/A41,0.5)","v":168.6467300928028},{"$f":"ROUND(ABS((B41-G41)/B41)*100,2)","v":1.59},27,{"$f":"INDEX(Integrale!$H$3:$H$502,MATCH('NGC0289'!D41,Integrale!$H$3:$H$502,1))","v":1.91},{"$f":"INDEX(Integrale!$I$3:$I$502,MATCH('NGC0289'!D41,Integrale!$H$3:$H$502,1))","v":0.0648469402},{"$f":"INDEX(Integrale!$H$3:$H$502,MATCH('NGC0289'!D41,Integrale!$H$3:$H$502,1)+1)","v":1.92},{"$f":"INDEX(Integrale!$I$3:$I$502,MATCH('NGC0289'!D41,Integrale!$H$3:$H$502,1)+1)","v":0.0648486973},{"$f":"(L41-D41)/(L41-J41)","v":0.633295838020253},{"$f":"(D41-J41)/(L41-J41)","v":0.366704161979747}]
[71.12,165,8.75,2,0.0648592413,450093452027.53143,164.98146126829442,0.01,28,{"$f":"INDEX(Integrale!$H$3:$H$502,MATCH('NGC0289'!D42,Integrale!$H$3:$H$502,1))","v":2},{"$f":"INDEX(Integrale!$I$3:$I$502,MATCH('NGC0289'!D42,Integrale!$H$3:$H$502,1))","v":0.0648592413},{"$f":"INDEX(Integrale!$H$3:$H$502,MATCH('NGC0289'!D42,Integrale!$H$3:$H$502,1)+1)","v":2.01},{"$f":"INDEX(Integrale!$I$3:$I$502,MATCH('NGC0289'!D42,Integrale!$H$3:$H$502,1)+1)","v":0.0648602055},1,0]
[{"$nulls":6},"Erreur moy",{"$f":"ROUND(AVERAGE(H15:H42),2)","v":28.7}]
[null,"Précision=",{"$f":"ROUND(MAX(0,100-H43),2)","v":71.3},"%"]
[]
["R","V_Obs","Incer V_Obs","V_TURI","A=(V_obs-V_TURI)^2","A/Incer V_Obs^2"]
[{"$f":"A15","v":1.5},{"$f":"B15","v":164},{"$f":"C15","v":28.2},{"$f":"ROUND(G15,2)","v":22.9},{"$f":"ROUND(POWER((B47-D47),2),2)","v":19909.21},{"$f":"ROUND(E47/POWER(C47,2),2)","v":25.04}]
[{"$f":"A16","v":2.52},{"$f":"B16","v":194},32,{"$f":"ROUND(G16,2)","v":37.53},{"$f":"ROUND(POWER((B48-D48),2),2)","v":24482.86},{"$f":"ROUND(E48/POWER(C48,2),2)","v":23.91}]
[3.46,{"$f":"B17","v":175},25.2,51.16,15336.35,24.15]
[4.32,{"$f":"B18","v":185},31.5,63.31,14808.46,14.92]
[5.43,{"$f":"B19","v":175},27.9,78.72,9269.84,11.91]
[6.38,{"$f":"B20","v":167},27.2,91.42,5712.34,7.72]
[7.57,{"$f":"B21","v":176},7.18,106.83,4784.49,92.81]
[10.6,{"$f":"B22","v":185},4.29,142.22,1830.13,99.44]
[13.57,{"$f":"B23","v":183},4.22,170.96,144.96,8.14]
[16.64,{"$f":"B24","v":172},4.33,193.97,482.68,25.74]
[19.71,{"$f":"B25","v":161},4.24,210.34,2434.44,135.42]
[22.68,{"$f":"B26","v":156},5.08,220.45,4153.8,160.96]
[25.75,{"$f":"B27","v":159},6.49,225.91,4476.95,106.29]
[28.72,173,6.97,227.38,2957.18,60.87]
[31.79,177,6.57,225.97,2398.06,55.56]
[34.77,179,4.47,222.65,1905.32,95.36]
[37.84,181,4.26,217.94,1364.56,75.19]
[40.81,182,4.26,212.71,943.1,51.97]
[43.88,182,4.83,207.01,625.5,26.81]
[46.85,180,5.5,201.47,460.96,15.24]
[49.92,177,8.5,195.88,356.45,4.93]
[52.99,175,11,190.55,241.8,2]
[55.96,172,11.6,185.66,186.6,1.39]
[59.03,168,12.6,180.91,166.67,1.05]
[62,158,5.38,176.61,346.33,11.97]
[65.07,158,6.5,172.44,208.51,4.94]
[{"$f":"A41","v":68.05},166,15.5,168.65,7.02,0.03]
[{"$f":"A42","v":71.12},165,8.75,164.98,0,0]
[{"$nulls":4},"X^2/d_f=",{"$f":"ROUND(SUM(F47:F74)/(COUNT(F47:F74)-2),2)","v":43.99}]

{"sheet":"Integrale","index":1,"n_rows":372,"n_cols":9,"rows_kept":372}
[{"$nulls":7},"u","I(u) = Integrale de 0 à u de ( x^2sech^8(x)dx"]
[{"$nulls":7},0,0]
[{"$nulls":7},0.01,4.998e-07]
[{"$nulls":7},0.02,2.9964e-06]
[{"$nulls":7},0.03,9.477e-06]
[{"$nulls":7},0.04,2.19098e-05]
[{"$nulls":7},0.05,4.22345e-05]
[{"$nulls":7},0.06,7.2353e-05]
[{"$nulls":7},0.07,0.0001141207]
[{"$nulls":7},0.08,1.693376E-4]
[{"$nulls":7},0.09,0.0002397401]
[{"$nulls":7},0.1,0.0003269934]
[{"$nulls":7},0.11,0.0004326832]
[{"$nulls":7},0.12,0.0005583096]
[{"$nulls":7},0.13,0.0007052805]
[{"$nulls":7},0.14,0.0008749055]
[{"$nulls":7},0.15,1.0683906E-3]
[{"$nulls":7},0.16,0.001286834]
[{"$nulls":7},0.17,0.001531222]
[{"$nulls":7},0.18,1.8024255E-3]
[{"$nulls":7},0.19,0.0021011974]
[{"$nulls":7},0.2,0.0024281708]
[{"$nulls":7},0.21,0.0027838579]
[{"$nulls":7},0.22,0.0031686489]
[{"$nulls":7},0.23,0.0035828125]
[{"$nulls":7},0.24,0.0040264964]
[{"$nulls":7},0.25,4.4997288E-3]
[{"$nulls":7},0.26,0.0050024204]
[{"$nulls":7},0.27,5.5343666E-3]
[{"$nulls":7},0.28,0.006095251]
[{"$nulls":7},0.29,0.0066846487]
[{"$nulls":7},0.3,0.0073020305]
[{"$nulls":7},0.31,0.0079467677]
[{"$nulls":7},0.32,0.0086181365]
[{"$nulls":7},0.33,0.0093153237]
[{"$nulls":7},0.34,0.010037432]
[{"$nulls":7},0.35,0.0107834863]
[{"$nulls":7},0.36,0.0115524392]
[{"$nulls":7},0.37,0.0123431779]
[{"$nulls":7},0.38,0.0131545302]
[{"$nulls":7},0.39,0.0139852712]
[{"$nulls":7},0.4,0.0148341297]
[{"$nulls":7},0.41,0.0156997951]
[{"$nulls":7},0.42,0.0165809236]
[{"$nulls":7},0.43,0.0174761447]
[{"$nulls":7},0.44,0.0183840679]
[{"$nulls":7},0.45,0.0193032886]
[{"$nulls":7},0.46,0.0202323944]
[{"$nulls":7},0.47,0.0211699709]
[{"$nulls":7},0.48,0.0221146072]
[{"$nulls":7},0.49,0.0230649017]
[{"$nulls":7},0.5,0.0240194669]
[{"$nulls":7},0.51,0.0249769344]
[{"$nulls":7},0.52,0.0259359595]
[{"$nulls":7},0.53,0.0268952255]
[{"$nulls":7},0.54,0.0278534477]
[{"$nulls":7},0.55,0.0288093767]
[{"$nulls":7},0.56,0.0297618021]
[{"$nulls":7},0.57,0.0307095554]
[{"$nulls":7},0.58,0.0316515125]
[{"$nulls":7},0.59,0.0325865959]
[{"$nulls":7},0.6,0.0335137772]
[{"$nulls":7},0.61,0.0344320783]
[{"$nulls":7},0.62,0.0353405729]
[{"$nulls":7},0.63,0.0362383877]
[{"$nulls":7},0.64,0.037124703]
[{"$nulls":7},0.65,0.0379987533]
[{"$nulls":7},0.66,0.0388598276]
[{"$nulls":7},0.67,0.0397072693]
[{"$nulls":7},0.68,0.040540476]
[{"$nulls":7},0.69,0.0413588991]
[{"$nulls":7},0.7,0.0421620429]
[{"$nulls":7},0.71,0.0429494641]
[{"$nulls":7},0.72,0.0437207705]
[{"$nulls":7},0.73,0.04447562]
[{"$nulls":7},0.74,0.0452137189]
[{"$nulls":7},0.75,0.0459348212]
[{"$nulls":7},0.76,0.0466387261]
[{"$nulls":7},0.77,0.0473252771]
[{"$nulls":7},0.78,0.0479943599]
[{"$nulls":7},0.79,0.0486459007]
[{"$nulls":7},0.8,0.0492798642]
[{"$nulls":7},0.81,0.0498962518]
[{"$nulls":7},0.82,0.0504950998]
[{"$nulls":7},0.83,0.0510764772]
[{"$nulls":7},0.84,0.0516404838]
[{"$nulls":7},0.85,0.0521872484]
[{"$nulls":7},0.86,0.0527169267]
[{"$nulls":7},0.87,0.0532296993]
[{"$nulls":7},0.88,0.0537257701]
[{"$nulls":7},0.89,0.0542053641]
[{"$nulls":7},0.9,0.0546687257]
[{"$nulls":7},0.91,0.0551161169]
[{"$nulls":7},0.92,0.0555478158]
[{"$nulls":7},0.93,0.0559641145]
[{"$nulls":7},0.94,0.0563653178]
[{"$nulls":7},0.95,0.0567517415]
[{"$nulls":7},0.96,0.0571237109]
[{"$nulls":7},0.97,0.0574815594]
[{"$nulls":7},0.98,0.0578256274]
[{"$nulls":7},0.99,0.0581562605]
[{"$nulls":7},1,0.0584738086]
[{"$nulls":7},1.01,0.0587786248]
[{"$nulls":7},1.02,0.059071064]
[{"$nulls":7},1.03,0.0593514822]
[{"$nulls":7},1.04,0.0596202355]
[{"$nulls":7},1.05,0.0598776791]
[{"$nulls":7},1.06,0.0601241663]
[{"$nulls":7},1.07,0.0603600483]
[{"$nulls":7},1.08,0.060585673]
[{"$nulls":7},1.09,0.0608013846]
[{"$nulls":7},1.1,0.0610075229]
[{"$nulls":7},1.11,0.0612044228]
[{"$nulls":7},1.12,0.0613924139]
[{"$nulls":7},1.13,0.0615718202]
[{"$nulls":7},1.14,0.0617429593]
[{"$nulls":7},1.15,0.0619061425]
[{"$nulls":7},1.16,0.0620616744]
[{"$nulls":7},1.17,0.0622098525]
[{"$nulls":7},1.18,0.0623509673]
[{"$nulls":7},1.19,0.0624853017]
[{"$nulls":7},1.2,0.0626131314]
[{"$nulls":7},1.21,0.0627347243]
[{"$nulls":7},1.22,0.0628503409]
[{"$nulls":7},1.23,0.0629602337]
[{"$nulls":7},1.24,0.0630646479]
[{"$nulls":7},1.25,0.0631638207]
[{"$nulls":7},1.26,0.0632579818]
[{"$nulls":7},1.27,0.0633473531]
[{"$nulls":7},1.28,0.0634321492]
[{"$nulls":7},1.29,0.0635125771]
[{"$nulls":7},1.3,0.0635888365]
[{"$nulls":7},1.31,0.0636611197]
[{"$nulls":7},1.32,0.0637296121]
[{"$nulls":7},1.33,0.0637944919]
[{"$nulls":7},1.34,0.0638559305]
[{"$nulls":7},1.35,0.0639140927]
[{"$nulls":7},1.36,0.0639691366]
[{"$nulls":7},1.37,0.064021214]
[{"$nulls":7},1.38,0.0640704704]
[{"$nulls":7},1.39,0.0641170452]
[{"$nulls":7},1.4,0.064161072]
[{"$nulls":7},1.41,0.0642026787]
[{"$nulls":7},1.42,0.0642419876]
[{"$nulls":7},1.43,0.0642791157]
[{"$nulls":7},1.44,0.0643141746]
[{"$nulls":7},1.45,0.064347271]
[{"$nulls":7},1.46,0.064378507]
[{"$nulls":7},1.47,0.0644079795]
[{"$nulls":7},1.48,0.0644357814]
[{"$nulls":7},1.49,0.0644620009]
[{"$nulls":7},1.5,0.0644867222]
[{"$nulls":7},1.51,0.0645100253]
[{"$nulls":7},1.52,0.0645319867]
[{"$nulls":7},1.53,0.0645526787]
[{"$nulls":7},1.54,0.0645721705]
[{"$nulls":7},1.55,0.0645905275]
[{"$nulls":7},1.56,0.0646078121]
[{"$nulls":7},1.57,0.0646240835]
[{"$nulls":7},1.58,0.0646393978]
[{"$nulls":7},1.59,0.0646538084]
[{"$nulls":7},1.6,0.0646673658]
[{"$nulls":7},1.61,0.064680118]
[{"$nulls":7},1.62,0.0646921104]
[{"$nulls":7},1.63,0.0647033862]
[{"$nulls":7},1.64,0.0647139861]
[{"$nulls":7},1.65,0.0647239487]
[{"$nulls":7},1.66,0.0647333107]
[{"$nulls":7},1.67,0.0647421067]
[{"$nulls":7},1.68,0.0647503694]
[{"$nulls":7},1.69,0.0647581297]
[{"$nulls":7},1.7,0.064765417]
[{"$nulls":7},1.71,0.064772259]
[{"$nulls":7},1.72,0.0647786817]
[{"$nulls":7},1.73,0.0647847098]
[{"$nulls":7},1.74,0.0647903667]
[{"$nulls":7},1.75,0.0647956744]
[{"$nulls":7},1.76,0.0648006536]
[{"$nulls":7},1.77,0.064805324]
[{"$nulls":7},1.78,0.0648097041]
[{"$nulls":7},1.79,0.0648138112]
[{"$nulls":7},1.8,0.0648176618]
[{"$nulls":7},1.81,0.0648212714]
[{"$nulls":7},1.82,0.0648246547]
[{"$nulls":7},1.83,0.0648278252]
[{"$nulls":7},1.84,0.0648307961]
[{"$nulls":7},1.85,0.0648335795]
[{"$nulls":7},1.86,0.0648361869]
[{"$nulls":7},1.87,0.0648386291]
[{"$nulls":7},1.88,0.0648409162]
[{"$nulls":7},1.89,0.0648430578]
[{"$nulls":7},1.9,0.064845063]
[{"$nulls":7},1.91,0.0648469402]
[{"$nulls":7},1.92,0.0648486973]
[{"$nulls":7},1.93,0.0648503418]
[{"$nulls":7},1.94,0.0648518808]
[{"$nulls":7},1.95,0.0648533208]
[{"$nulls":7},1.96,0.0648546681]
[{"$nulls":7},1.97,0.0648559285]
[{"$nulls":7},1.98,0.0648571074]
{"$rows_left_out":173}
{"sheet":"Feuil3","index":2,"n_rows":0,"n_cols":0,"rows_kept":0}