{"text_format":"3","workbook":"xlsx","n_sheets":3,"sheets":["NGC2915","Integrale","Feuil3"],"not_rendered":{"charts":2},"read":"whole","date_system":"1900"}

{"sheet":"NGC2915","index":0,"n_rows":79,"n_cols":15,"rows_kept":79,"merged":[[9,2,9,3],[12,3,12,5],[13,9,13,14]]}
[]
[]
[null,"ρ(r) = ρ0sech^8( r/ r_c)"]
[]
[]
["M(R) =4πρ0,r_c^3 ·I(u)",null,"u = R/r_c","I(u) = Integrale de 0 à u de ( x^2sech^8(x)dx",{"$nulls":3},"V_TURI(R) = Racine (G·M(R)/R)"]
[]
[{"$nulls":7},"G=",{"$f":"4.3009*POWER(10,-6)","v":4.3009000000000006E-6},"10^-6,KPC,(Km/s)^2/Mo"]
["NGC2915","R_max=",{"$f":"A44","v":10.04},"V_obs(R_max)=",{"$f":"B44","v":86.5}]
[null,"M_totale=","V_obs^2(R_max).R_max/G=",null,{"$f":"E9*E9*C9/I8","v":17466527936.01339},"Mo","I(infini)=",0.0648738184]
[{"$nulls":6},"M(R) = racine(G,M(R)/R)"]
[null,"r_c=R_max=",{"$f":"C9","v":10.04},"ρ0=",{"$f":"(E10/(POWER(C12,3)*4*3.14159*H10))","v":21170274.363319483},"Mo/kpc^3","π=",3.14159]
[{"$nulls":3},"=M_tot/4.π.r_c^3.I(infini)"]
["R","V_obs","incer V_obs","u=R/r-c","I(U) par table","M(R) ","V_TURI","Erreur %",null,"calculs intermediaires de I(u)"]
[0.34,13.5,10.1,{"$f":"A15/$C$12","v":0.03386454183266933},{"$f":"N15*K15+O15*M15","v":1.4281707569721121E-5},{"$f":"4*$H$12*$E$12*POWER($C$12,3)*E15","v":3845185.1670335443},{"$f":"POWER($I$8*F15/A15,0.5)","v":6.97427139034326},{"$f":"ROUND(ABS((B15-G15)/B15)*100,2)","v":48.34},null,{"$f":"INDEX(Integrale!$H$3:$H$502,MATCH('NGC2915'!D15,Integrale!$H$3:$H$502,1))","v":0.03},{"$f":"INDEX(Integrale!$I$3:$I$502,MATCH('NGC2915'!D15,Integrale!$H$3:$H$502,1))","v":9.477e-06},{"$f":"INDEX(Integrale!$H$3:$H$502,MATCH('NGC2915'!D15,Integrale!$H$3:$H$502,1)+1)","v":0.04},{"$f":"INDEX(Integrale!$I$3:$I$502,MATCH('NGC2915'!D15,Integrale!$H$3:$H$502,1)+1)","v":2.19098e-05},{"$f":"(L15-D15)/(L15-J15)","v":0.6135458167330672},{"$f":"(D15-J15)/(L15-J15)","v":0.38645418326693276}]
[0.67,31.3,12.5,0.06673306772908368,{"$f":"N16*K16+O16*M16","v":1.0047547529880481E-4},{"$f":"4*$H$12*$E$12*POWER($C$12,3)*E16","v":27051863.74833144},13.177737943450943,57.9,null,{"$f":"INDEX(Integrale!$H$3:$H$502,MATCH('NGC2915'!D16,Integrale!$H$3:$H$502,1))","v":0.06},{"$f":"INDEX(Integrale!$I$3:$I$502,MATCH('NGC2915'!D16,Integrale!$H$3:$H$502,1))","v":7.2353e-05},{"$f":"INDEX(Integrale!$H$3:$H$502,MATCH('NGC2915'!D16,Integrale!$H$3:$H$502,1)+1)","v":0.07},{"$f":"INDEX(Integrale!$I$3:$I$502,MATCH('NGC2915'!D16,Integrale!$H$3:$H$502,1)+1)","v":0.0001141207},{"$f":"(L16-D16)/(L16-J16)","v":0.32669322709163284},0.6733067729083672]
[1,35.3,13.4,0.09960159362549802,3.2351717290836655E-4,87103270.2829784,19.3551661103712,45.17,null,{"$f":"INDEX(Integrale!$H$3:$H$502,MATCH('NGC2915'!D17,Integrale!$H$3:$H$502,1))","v":0.09},{"$f":"INDEX(Integrale!$I$3:$I$502,MATCH('NGC2915'!D17,Integrale!$H$3:$H$502,1))","v":0.0002397401},{"$f":"INDEX(Integrale!$H$3:$H$502,MATCH('NGC2915'!D17,Integrale!$H$3:$H$502,1)+1)","v":0.1},{"$f":"INDEX(Integrale!$I$3:$I$502,MATCH('NGC2915'!D17,Integrale!$H$3:$H$502,1)+1)","v":0.0003269934},0.039840637450198856,0.9601593625498012]
[1.34,50.5,9.38,0.13346613545816735,7.640748227091636E-4,205718340.08238494,25.695896775356918,49.12,null,{"$f":"INDEX(Integrale!$H$3:$H$502,MATCH('NGC2915'!D18,Integrale!$H$3:$H$502,1))","v":0.13},{"$f":"INDEX(Integrale!$I$3:$I$502,MATCH('NGC2915'!D18,Integrale!$H$3:$H$502,1))","v":0.0007052805},{"$f":"INDEX(Integrale!$H$3:$H$502,MATCH('NGC2915'!D18,Integrale!$H$3:$H$502,1)+1)","v":0.14},{"$f":"INDEX(Integrale!$I$3:$I$502,MATCH('NGC2915'!D18,Integrale!$H$3:$H$502,1)+1)","v":0.0008749055},0.6533864541832657,0.3466135458167343]
[1.68,61,10.1,0.16733067729083667,1.4659869561752992E-3,394700092.5086151,31.787666332638835,47.89,null,{"$f":"INDEX(Integrale!$H$3:$H$502,MATCH('NGC2915'!D19,Integrale!$H$3:$H$502,1))","v":0.16},{"$f":"INDEX(Integrale!$I$3:$I$502,MATCH('NGC2915'!D19,Integrale!$H$3:$H$502,1))","v":0.001286834},{"$f":"INDEX(Integrale!$H$3:$H$502,MATCH('NGC2915'!D19,Integrale!$H$3:$H$502,1)+1)","v":0.17},{"$f":"INDEX(Integrale!$I$3:$I$502,MATCH('NGC2915'!D19,Integrale!$H$3:$H$502,1)+1)","v":0.001531222},0.26693227091633387,0.7330677290836661]
[2.01,66.5,11.9,0.20019920318725098,2.435256200398406E-3,655664665.7260516,37.4560980881703,43.68,null,{"$f":"INDEX(Integrale!$H$3:$H$502,MATCH('NGC2915'!D20,Integrale!$H$3:$H$502,1))","v":0.2},{"$f":"INDEX(Integrale!$I$3:$I$502,MATCH('NGC2915'!D20,Integrale!$H$3:$H$502,1))","v":0.0024281708},{"$f":"INDEX(Integrale!$H$3:$H$502,MATCH('NGC2915'!D20,Integrale!$H$3:$H$502,1)+1)","v":0.21},{"$f":"INDEX(Integrale!$I$3:$I$502,MATCH('NGC2915'!D20,Integrale!$H$3:$H$502,1)+1)","v":0.0027838579},0.9800796812749026,0.0199203187250974]
[2.34,74.4,11.6,0.23306772908366535,0.003718922700398407,1001277076.6455011,42.89916909394283,42.34,null,{"$f":"INDEX(Integrale!$H$3:$H$502,MATCH('NGC2915'!D21,Integrale!$H$3:$H$502,1))","v":0.23},{"$f":"INDEX(Integrale!$I$3:$I$502,MATCH('NGC2915'!D21,Integrale!$H$3:$H$502,1))","v":0.0035828125},{"$f":"INDEX(Integrale!$H$3:$H$502,MATCH('NGC2915'!D21,Integrale!$H$3:$H$502,1)+1)","v":0.24},{"$f":"INDEX(Integrale!$I$3:$I$502,MATCH('NGC2915'!D21,Integrale!$H$3:$H$502,1)+1)","v":0.0040264964},0.6932270916334651,0.3067729083665349]
[2.67,83,9.17,0.2659362549800797,5.318197227888447E-3,1431863311.596632,48.02582372158818,42.14,null,{"$f":"INDEX(Integrale!$H$3:$H$502,MATCH('NGC2915'!D22,Integrale!$H$3:$H$502,1))","v":0.26},{"$f":"INDEX(Integrale!$I$3:$I$502,MATCH('NGC2915'!D22,Integrale!$H$3:$H$502,1))","v":0.0050024204},{"$f":"INDEX(Integrale!$H$3:$H$502,MATCH('NGC2915'!D22,Integrale!$H$3:$H$502,1)+1)","v":0.27},{"$f":"INDEX(Integrale!$I$3:$I$502,MATCH('NGC2915'!D22,Integrale!$H$3:$H$502,1)+1)","v":5.5343666E-3},0.4063745019920291,0.5936254980079708]
[3.01,86.4,7.66,0.299800796812749,0.007289732057768925,1962676342.6811528,52.95668223590242,38.71,null,{"$f":"INDEX(Integrale!$H$3:$H$502,MATCH('NGC2915'!D23,Integrale!$H$3:$H$502,1))","v":0.29},{"$f":"INDEX(Integrale!$I$3:$I$502,MATCH('NGC2915'!D23,Integrale!$H$3:$H$502,1))","v":0.0066846487},{"$f":"INDEX(Integrale!$H$3:$H$502,MATCH('NGC2915'!D23,Integrale!$H$3:$H$502,1)+1)","v":0.3},{"$f":"INDEX(Integrale!$I$3:$I$502,MATCH('NGC2915'!D23,Integrale!$H$3:$H$502,1)+1)","v":0.0073020305},0.019920318725097346,0.9800796812749026]
[3.35,83.6,8.18,0.33366533864541836,0.009580000845816734,2579304818.605989,57.545133731894666,31.17,null,{"$f":"INDEX(Integrale!$H$3:$H$502,MATCH('NGC2915'!D24,Integrale!$H$3:$H$502,1))","v":0.33},{"$f":"INDEX(Integrale!$I$3:$I$502,MATCH('NGC2915'!D24,Integrale!$H$3:$H$502,1))","v":0.0093153237},{"$f":"INDEX(Integrale!$H$3:$H$502,MATCH('NGC2915'!D24,Integrale!$H$3:$H$502,1)+1)","v":0.34},{"$f":"INDEX(Integrale!$I$3:$I$502,MATCH('NGC2915'!D24,Integrale!$H$3:$H$502,1)+1)","v":0.010037432},0.6334661354581655,0.36653386454183445]
[3.68,79.8,7.93,0.36653386454183273,0.012069097155378492,3249465313.219148,61.62567877222141,22.77,null,{"$f":"INDEX(Integrale!$H$3:$H$502,MATCH('NGC2915'!D25,Integrale!$H$3:$H$502,1))","v":0.36},{"$f":"INDEX(Integrale!$I$3:$I$502,MATCH('NGC2915'!D25,Integrale!$H$3:$H$502,1))","v":0.0115524392},{"$f":"INDEX(Integrale!$H$3:$H$502,MATCH('NGC2915'!D25,Integrale!$H$3:$H$502,1)+1)","v":0.37},{"$f":"INDEX(Integrale!$I$3:$I$502,MATCH('NGC2915'!D25,Integrale!$H$3:$H$502,1)+1)","v":0.0123431779},0.346613545816726,0.653386454183274]
[4.02,82.8,6.95,0.40039840637450197,{"$f":"N26*K26+O26*M26","v":0.014868618361354578},4003204133.557234,65.44410219373749,20.96,null,{"$f":"INDEX(Integrale!$H$3:$H$502,MATCH('NGC2915'!D26,Integrale!$H$3:$H$502,1))","v":0.4},{"$f":"INDEX(Integrale!$I$3:$I$502,MATCH('NGC2915'!D26,Integrale!$H$3:$H$502,1))","v":0.0148341297},{"$f":"INDEX(Integrale!$H$3:$H$502,MATCH('NGC2915'!D26,Integrale!$H$3:$H$502,1)+1)","v":0.41},{"$f":"INDEX(Integrale!$I$3:$I$502,MATCH('NGC2915'!D26,Integrale!$H$3:$H$502,1)+1)","v":0.0156997951},0.960159362549805,0.039840637450194914]
[4.35,83.5,7.19,{"$f":"A27/$C$12","v":0.43326693227091634},{"$f":"N27*K27+O27*M27","v":0.017772757060159364},{"$f":"4*$H$12*$E$12*POWER($C$12,3)*E27","v":4785110008.126987},{"$f":"POWER($I$8*F27/A27,0.5)","v":68.7829831166551},{"$f":"ROUND(ABS((B27-G27)/B27)*100,2)","v":17.63},null,{"$f":"INDEX(Integrale!$H$3:$H$502,MATCH('NGC2915'!D27,Integrale!$H$3:$H$502,1))","v":0.43},{"$f":"INDEX(Integrale!$I$3:$I$502,MATCH('NGC2915'!D27,Integrale!$H$3:$H$502,1))","v":0.0174761447},{"$f":"INDEX(Integrale!$H$3:$H$502,MATCH('NGC2915'!D27,Integrale!$H$3:$H$502,1)+1)","v":0.44},{"$f":"INDEX(Integrale!$I$3:$I$502,MATCH('NGC2915'!D27,Integrale!$H$3:$H$502,1)+1)","v":0.0183840679},{"$f":"(L27-D27)/(L27-J27)","v":0.6733067729083658},{"$f":"(D27-J27)/(L27-J27)","v":0.32669322709163423}]
[4.68,80.4,7.85,0.4661354581673307,0.020807640539442236,5602217408.012051,71.75244843810587,10.76,null,{"$f":"INDEX(Integrale!$H$3:$H$502,MATCH('NGC2915'!D28,Integrale!$H$3:$H$502,1))","v":0.46},{"$f":"INDEX(Integrale!$I$3:$I$502,MATCH('NGC2915'!D28,Integrale!$H$3:$H$502,1))","v":0.0202323944},{"$f":"INDEX(Integrale!$H$3:$H$502,MATCH('NGC2915'!D28,Integrale!$H$3:$H$502,1)+1)","v":0.47},{"$f":"INDEX(Integrale!$I$3:$I$502,MATCH('NGC2915'!D28,Integrale!$H$3:$H$502,1)+1)","v":0.0211699709},0.3864541832669284,0.6135458167330716]
[5.02,80.3,7.57,0.5,0.0240194669,6466964639.420683,74.43514813865282,7.3,null,{"$f":"INDEX(Integrale!$H$3:$H$502,MATCH('NGC2915'!D29,Integrale!$H$3:$H$502,1))","v":0.5},{"$f":"INDEX(Integrale!$I$3:$I$502,MATCH('NGC2915'!D29,Integrale!$H$3:$H$502,1))","v":0.0240194669},{"$f":"INDEX(Integrale!$H$3:$H$502,MATCH('NGC2915'!D29,Integrale!$H$3:$H$502,1)+1)","v":0.51},{"$f":"INDEX(Integrale!$I$3:$I$502,MATCH('NGC2915'!D29,Integrale!$H$3:$H$502,1)+1)","v":0.0249769344},1,0]
[5.35,82.1,7.92,{"$f":"A30/$C$12","v":0.5328685258964143},{"$f":"N30*K30+O30*M30","v":0.027170094019521904},{"$f":"4*$H$12*$E$12*POWER($C$12,3)*E30","v":7315234680.499238},{"$f":"POWER($I$8*F30/A30,0.5)","v":76.686146182533},{"$f":"ROUND(ABS((B30-G30)/B30)*100,2)","v":6.59},null,{"$f":"INDEX(Integrale!$H$3:$H$502,MATCH('NGC2915'!D30,Integrale!$H$3:$H$502,1))","v":0.53},{"$f":"INDEX(Integrale!$I$3:$I$502,MATCH('NGC2915'!D30,Integrale!$H$3:$H$502,1))","v":0.0268952255},{"$f":"INDEX(Integrale!$H$3:$H$502,MATCH('NGC2915'!D30,Integrale!$H$3:$H$502,1)+1)","v":0.54},{"$f":"INDEX(Integrale!$I$3:$I$502,MATCH('NGC2915'!D30,Integrale!$H$3:$H$502,1)+1)","v":0.0278534477},{"$f":"(L30-D30)/(L30-J30)","v":0.7131474103585715},{"$f":"(D30-J30)/(L30-J30)","v":0.2868525896414284}]
[5.69,82.4,8.33,0.5667330677290837,0.03039993081593626,8184831014.1926985,78.6553735428176,4.54,null,{"$f":"INDEX(Integrale!$H$3:$H$502,MATCH('NGC2915'!D31,Integrale!$H$3:$H$502,1))","v":0.56},{"$f":"INDEX(Integrale!$I$3:$I$502,MATCH('NGC2915'!D31,Integrale!$H$3:$H$502,1))","v":0.0297618021},{"$f":"INDEX(Integrale!$H$3:$H$502,MATCH('NGC2915'!D31,Integrale!$H$3:$H$502,1)+1)","v":0.57},{"$f":"INDEX(Integrale!$I$3:$I$502,MATCH('NGC2915'!D31,Integrale!$H$3:$H$502,1)+1)","v":0.0307095554},0.32669322709162674,0.6733067729083733]
[6.03,80.9,7.88,0.600597609561753,0.03356865575179283,9037973683.742746,80.28909313858544,0.76,null,{"$f":"INDEX(Integrale!$H$3:$H$502,MATCH('NGC2915'!D32,Integrale!$H$3:$H$502,1))","v":0.6},{"$f":"INDEX(Integrale!$I$3:$I$502,MATCH('NGC2915'!D32,Integrale!$H$3:$H$502,1))","v":0.0335137772},{"$f":"INDEX(Integrale!$H$3:$H$502,MATCH('NGC2915'!D32,Integrale!$H$3:$H$502,1)+1)","v":0.61},{"$f":"INDEX(Integrale!$I$3:$I$502,MATCH('NGC2915'!D32,Integrale!$H$3:$H$502,1)+1)","v":0.0344320783},0.9402390438246968,0.05976095617530314]
[6.36,79,6.15,0.6334661354581674,0.03654559658884463,9839480694.99375,81.57126617615755,3.25,null,{"$f":"INDEX(Integrale!$H$3:$H$502,MATCH('NGC2915'!D33,Integrale!$H$3:$H$502,1))","v":0.63},{"$f":"INDEX(Integrale!$I$3:$I$502,MATCH('NGC2915'!D33,Integrale!$H$3:$H$502,1))","v":0.0362383877},{"$f":"INDEX(Integrale!$H$3:$H$502,MATCH('NGC2915'!D33,Integrale!$H$3:$H$502,1)+1)","v":0.64},{"$f":"INDEX(Integrale!$I$3:$I$502,MATCH('NGC2915'!D33,Integrale!$H$3:$H$502,1)+1)","v":0.037124703},0.6533864541832574,0.34661354581674264]
[6.69,81.4,6.11,0.6663346613545817,0.039396653218725104,10607094834.274372,82.57809111348955,1.45,null,{"$f":"INDEX(Integrale!$H$3:$H$502,MATCH('NGC2915'!D34,Integrale!$H$3:$H$502,1))","v":0.66},{"$f":"INDEX(Integrale!$I$3:$I$502,MATCH('NGC2915'!D34,Integrale!$H$3:$H$502,1))","v":0.0388598276},{"$f":"INDEX(Integrale!$H$3:$H$502,MATCH('NGC2915'!D34,Integrale!$H$3:$H$502,1)+1)","v":0.67},{"$f":"INDEX(Integrale!$I$3:$I$502,MATCH('NGC2915'!D34,Integrale!$H$3:$H$502,1)+1)","v":0.0397072693},0.3665338645418289,0.6334661354581711]
[7.02,79.7,5.59,0.6992031872509961,0.04209804737808766,11334414078.22209,83.33177905304835,4.56,null,{"$f":"INDEX(Integrale!$H$3:$H$502,MATCH('NGC2915'!D35,Integrale!$H$3:$H$502,1))","v":0.69},{"$f":"INDEX(Integrale!$I$3:$I$502,MATCH('NGC2915'!D35,Integrale!$H$3:$H$502,1))","v":0.0413588991},{"$f":"INDEX(Integrale!$H$3:$H$502,MATCH('NGC2915'!D35,Integrale!$H$3:$H$502,1)+1)","v":0.7},{"$f":"INDEX(Integrale!$I$3:$I$502,MATCH('NGC2915'!D35,Integrale!$H$3:$H$502,1)+1)","v":0.0421620429},0.07968127490038938,0.9203187250996107]
[7.36,77.5,6.33,0.7330677290836655,0.044702048746215146,12035511435.577824,83.86351095199389,8.21,null,{"$f":"INDEX(Integrale!$H$3:$H$502,MATCH('NGC2915'!D36,Integrale!$H$3:$H$502,1))","v":0.73},{"$f":"INDEX(Integrale!$I$3:$I$502,MATCH('NGC2915'!D36,Integrale!$H$3:$H$502,1))","v":0.04447562},{"$f":"INDEX(Integrale!$H$3:$H$502,MATCH('NGC2915'!D36,Integrale!$H$3:$H$502,1)+1)","v":0.74},{"$f":"INDEX(Integrale!$I$3:$I$502,MATCH('NGC2915'!D36,Integrale!$H$3:$H$502,1)+1)","v":0.0452137189},0.693227091633452,0.30677290836654797]
[7.7,79.9,6.41,0.7669322709163348,0.04711466185298804,12685079709.305964,84.17457070561483,5.35,null,{"$f":"INDEX(Integrale!$H$3:$H$502,MATCH('NGC2915'!D37,Integrale!$H$3:$H$502,1))","v":0.76},{"$f":"INDEX(Integrale!$I$3:$I$502,MATCH('NGC2915'!D37,Integrale!$H$3:$H$502,1))","v":0.0466387261},{"$f":"INDEX(Integrale!$H$3:$H$502,MATCH('NGC2915'!D37,Integrale!$H$3:$H$502,1)+1)","v":0.77},{"$f":"INDEX(Integrale!$I$3:$I$502,MATCH('NGC2915'!D37,Integrale!$H$3:$H$502,1)+1)","v":0.0473252771},0.30677290836652577,0.6932270916334742]
[8.03,81.5,7.86,0.799800796812749,0.049267235445019916,13264635340.635187,84.28873915749,3.42,null,{"$f":"INDEX(Integrale!$H$3:$H$502,MATCH('NGC2915'!D38,Integrale!$H$3:$H$502,1))","v":0.79},{"$f":"INDEX(Integrale!$I$3:$I$502,MATCH('NGC2915'!D38,Integrale!$H$3:$H$502,1))","v":0.0486459007},{"$f":"INDEX(Integrale!$H$3:$H$502,MATCH('NGC2915'!D38,Integrale!$H$3:$H$502,1)+1)","v":0.8},{"$f":"INDEX(Integrale!$I$3:$I$502,MATCH('NGC2915'!D38,Integrale!$H$3:$H$502,1)+1)","v":0.0492798642},0.01992031872510845,0.9800796812748915]
[8.37,82.2,7.82,0.8336653386454184,0.0512832047187251,13807411833.614305,84.23121840945997,2.47,null,{"$f":"INDEX(Integrale!$H$3:$H$502,MATCH('NGC2915'!D39,Integrale!$H$3:$H$502,1))","v":0.83},{"$f":"INDEX(Integrale!$I$3:$I$502,MATCH('NGC2915'!D39,Integrale!$H$3:$H$502,1))","v":0.0510764772},{"$f":"INDEX(Integrale!$H$3:$H$502,MATCH('NGC2915'!D39,Integrale!$H$3:$H$502,1)+1)","v":0.84},{"$f":"INDEX(Integrale!$I$3:$I$502,MATCH('NGC2915'!D39,Integrale!$H$3:$H$502,1)+1)","v":0.0516404838},0.63346613545816,0.36653386454184]
[8.7,82,7.09,0.8665338645418327,0.05305196537091634,14283630254.320362,84.03096402538308,2.48,null,{"$f":"INDEX(Integrale!$H$3:$H$502,MATCH('NGC2915'!D40,Integrale!$H$3:$H$502,1))","v":0.86},{"$f":"INDEX(Integrale!$I$3:$I$502,MATCH('NGC2915'!D40,Integrale!$H$3:$H$502,1))","v":0.0527169267},{"$f":"INDEX(Integrale!$H$3:$H$502,MATCH('NGC2915'!D40,Integrale!$H$3:$H$502,1)+1)","v":0.87},{"$f":"INDEX(Integrale!$I$3:$I$502,MATCH('NGC2915'!D40,Integrale!$H$3:$H$502,1)+1)","v":0.0532296993},0.34661354581673154,0.6533864541832685]
[9.03,84.7,5.74,0.899402390438247,0.05464103476772907,14711468875.450356,83.70739291495366,1.17,null,{"$f":"INDEX(Integrale!$H$3:$H$502,MATCH('NGC2915'!D41,Integrale!$H$3:$H$502,1))","v":0.89},{"$f":"INDEX(Integrale!$I$3:$I$502,MATCH('NGC2915'!D41,Integrale!$H$3:$H$502,1))","v":0.0542053641},{"$f":"INDEX(Integrale!$H$3:$H$502,MATCH('NGC2915'!D41,Integrale!$H$3:$H$502,1)+1)","v":0.9},{"$f":"INDEX(Integrale!$I$3:$I$502,MATCH('NGC2915'!D41,Integrale!$H$3:$H$502,1)+1)","v":0.0546687257},0.05976095617530314,0.9402390438246968]
[9.37,86.1,5.54,0.9332669322709163,0.05609518490079681,15102982039.756178,83.26092472076067,3.3,null,{"$f":"INDEX(Integrale!$H$3:$H$502,MATCH('NGC2915'!D42,Integrale!$H$3:$H$502,1))","v":0.93},{"$f":"INDEX(Integrale!$I$3:$I$502,MATCH('NGC2915'!D42,Integrale!$H$3:$H$502,1))","v":0.0559641145},{"$f":"INDEX(Integrale!$H$3:$H$502,MATCH('NGC2915'!D42,Integrale!$H$3:$H$502,1)+1)","v":0.94},{"$f":"INDEX(Integrale!$I$3:$I$502,MATCH('NGC2915'!D42,Integrale!$H$3:$H$502,1)+1)","v":0.0563653178},0.6733067729083733,0.32669322709162674]
[9.7,85.3,5.23,0.9661354581673307,0.057343267350199206,15439013855.156994,82.7377266505648,3,null,{"$f":"INDEX(Integrale!$H$3:$H$502,MATCH('NGC2915'!D43,Integrale!$H$3:$H$502,1))","v":0.96},{"$f":"INDEX(Integrale!$I$3:$I$502,MATCH('NGC2915'!D43,Integrale!$H$3:$H$502,1))","v":0.0571237109},{"$f":"INDEX(Integrale!$H$3:$H$502,MATCH('NGC2915'!D43,Integrale!$H$3:$H$502,1)+1)","v":0.97},{"$f":"INDEX(Integrale!$I$3:$I$502,MATCH('NGC2915'!D43,Integrale!$H$3:$H$502,1)+1)","v":0.0574815594},0.38645418326692627,0.6135458167330737]
[10.04,86.5,6.45,1,0.0584738086,15743399057.22275,82.1224822576152,5.06,null,{"$f":"INDEX(Integrale!$H$3:$H$502,MATCH('NGC2915'!D44,Integrale!$H$3:$H$502,1))","v":1},{"$f":"INDEX(Integrale!$I$3:$I$502,MATCH('NGC2915'!D44,Integrale!$H$3:$H$502,1))","v":0.0584738086},{"$f":"INDEX(Integrale!$H$3:$H$502,MATCH('NGC2915'!D44,Integrale!$H$3:$H$502,1)+1)","v":1.01},{"$f":"INDEX(Integrale!$I$3:$I$502,MATCH('NGC2915'!D44,Integrale!$H$3:$H$502,1)+1)","v":0.0587786248},1,0]
[{"$nulls":6},"Erreur moy",{"$f":"ROUND(AVERAGE(H15:H44),2)","v":19.38}]
[null,"Précision=",{"$f":"ROUND(MAX(0,100-H45),2)","v":80.62},"%"]
[]
["R","V_Obs","Incer V_Obs","V_TURI","A=(V_obs-V_TURI)^2","A/Incer V_Obs^2"]
[{"$f":"A15","v":0.34},13.5,10.1,{"$f":"ROUND(G15,2)","v":6.97},{"$f":"ROUND(POWER((B49-D49),2),2)","v":42.64},{"$f":"ROUND(E49/POWER(C49,2),2)","v":0.42}]
[0.67,31.3,12.5,13.18,{"$f":"ROUND(POWER((B50-D50),2),2)","v":328.33},{"$f":"ROUND(E50/POWER(C50,2),2)","v":2.1}]
[1,35.3,13.4,19.36,254.08,1.42]
[1.34,50.5,9.38,25.7,615.04,6.99]
[1.68,61,10.1,31.79,853.22,8.36]
[2.01,66.5,11.9,37.46,843.32,5.96]
[2.34,74.4,11.6,42.9,992.25,7.37]
[2.67,83,9.17,48.03,1222.9,14.54]
[3.01,86.4,7.66,52.96,1118.23,19.06]
[3.35,83.6,8.18,57.55,678.6,10.14]
[3.68,79.8,7.93,61.63,330.15,5.25]
[4.02,82.8,6.95,65.44,301.37,6.24]
[{"$f":"A27","v":4.35},{"$f":"B27","v":83.5},{"$f":"C27","v":7.19},68.78,{"$f":"ROUND(POWER((B61-D61),2),2)","v":216.68},{"$f":"ROUND(E61/POWER(C61,2),2)","v":4.19}]
[{"$f":"A28","v":4.68},80.4,7.85,71.75,74.82,1.21]
[{"$f":"A29","v":5.02},80.3,7.57,74.44,34.34,0.6]
[{"$f":"A30","v":5.35},82.1,7.92,{"$f":"ROUND(G30,2)","v":76.69},{"$f":"ROUND(POWER((B64-D64),2),2)","v":29.27},{"$f":"ROUND(E64/POWER(C64,2),2)","v":0.47}]
[{"$f":"A31","v":5.69},82.4,8.33,78.66,13.99,0.2]
[{"$f":"A32","v":6.03},80.9,7.88,80.29,0.37,0.01]
[{"$f":"A33","v":6.36},79,6.15,81.57,6.6,0.17]
[{"$f":"A34","v":6.69},81.4,6.11,82.58,1.39,0.04]
[{"$f":"A35","v":7.02},79.7,5.59,83.33,13.18,0.42]
[{"$f":"A36","v":7.36},77.5,6.33,83.86,40.45,1.01]
[{"$f":"A37","v":7.7},79.9,6.41,84.17,18.23,0.44]
[{"$f":"A38","v":8.03},81.5,7.86,84.29,7.78,0.13]
[{"$f":"A39","v":8.37},82.2,7.82,84.23,4.12,0.07]
[{"$f":"A40","v":8.7},82,7.09,84.03,4.12,0.08]
[{"$f":"A41","v":9.03},84.7,5.74,83.71,0.98,0.03]
[{"$f":"A42","v":9.37},86.1,5.54,83.26,8.07,0.26]
[{"$f":"A43","v":9.7},85.3,5.23,82.74,6.55,0.24]
[{"$f":"A44","v":10.04},86.5,6.45,82.12,19.18,0.46]
[{"$nulls":4},"ᵡ2/df",{"$f":"ROUND(SUM(F49:F78)/(COUNT(F49:F78)),2)","v":3.26}]

{"sheet":"Integrale","index":1,"n_rows":372,"n_cols":9,"rows_kept":372}
[{"$nulls":7},"u","I(u) = Integrale de 0 à u de ( x^2sech^8(x)dx"]
[{"$nulls":7},0,0]
[{"$nulls":7},0.01,4.998e-07]
[{"$nulls":7},0.02,2.9964e-06]
[{"$nulls":7},0.03,9.477e-06]
[{"$nulls":7},0.04,2.19098e-05]
[{"$nulls":7},0.05,4.22345e-05]
[{"$nulls":7},0.06,7.2353e-05]
[{"$nulls":7},0.07,0.0001141207]
[{"$nulls":7},0.08,1.693376E-4]
[{"$nulls":7},0.09,0.0002397401]
[{"$nulls":7},0.1,0.0003269934]
[{"$nulls":7},0.11,0.0004326832]
[{"$nulls":7},0.12,0.0005583096]
[{"$nulls":7},0.13,0.0007052805]
[{"$nulls":7},0.14,0.0008749055]
[{"$nulls":7},0.15,1.0683906E-3]
[{"$nulls":7},0.16,0.001286834]
[{"$nulls":7},0.17,0.001531222]
[{"$nulls":7},0.18,1.8024255E-3]
[{"$nulls":7},0.19,0.0021011974]
[{"$nulls":7},0.2,0.0024281708]
[{"$nulls":7},0.21,0.0027838579]
[{"$nulls":7},0.22,0.0031686489]
[{"$nulls":7},0.23,0.0035828125]
[{"$nulls":7},0.24,0.0040264964]
[{"$nulls":7},0.25,4.4997288E-3]
[{"$nulls":7},0.26,0.0050024204]
[{"$nulls":7},0.27,5.5343666E-3]
[{"$nulls":7},0.28,0.006095251]
[{"$nulls":7},0.29,0.0066846487]
[{"$nulls":7},0.3,0.0073020305]
[{"$nulls":7},0.31,0.0079467677]
[{"$nulls":7},0.32,0.0086181365]
[{"$nulls":7},0.33,0.0093153237]
[{"$nulls":7},0.34,0.010037432]
[{"$nulls":7},0.35,0.0107834863]
[{"$nulls":7},0.36,0.0115524392]
[{"$nulls":7},0.37,0.0123431779]
[{"$nulls":7},0.38,0.0131545302]
[{"$nulls":7},0.39,0.0139852712]
[{"$nulls":7},0.4,0.0148341297]
[{"$nulls":7},0.41,0.0156997951]
[{"$nulls":7},0.42,0.0165809236]
[{"$nulls":7},0.43,0.0174761447]
[{"$nulls":7},0.44,0.0183840679]
[{"$nulls":7},0.45,0.0193032886]
[{"$nulls":7},0.46,0.0202323944]
[{"$nulls":7},0.47,0.0211699709]
[{"$nulls":7},0.48,0.0221146072]
[{"$nulls":7},0.49,0.0230649017]
[{"$nulls":7},0.5,0.0240194669]
[{"$nulls":7},0.51,0.0249769344]
[{"$nulls":7},0.52,0.0259359595]
[{"$nulls":7},0.53,0.0268952255]
[{"$nulls":7},0.54,0.0278534477]
[{"$nulls":7},0.55,0.0288093767]
[{"$nulls":7},0.56,0.0297618021]
[{"$nulls":7},0.57,0.0307095554]
[{"$nulls":7},0.58,0.0316515125]
[{"$nulls":7},0.59,0.0325865959]
[{"$nulls":7},0.6,0.0335137772]
[{"$nulls":7},0.61,0.0344320783]
[{"$nulls":7},0.62,0.0353405729]
[{"$nulls":7},0.63,0.0362383877]
[{"$nulls":7},0.64,0.037124703]
[{"$nulls":7},0.65,0.0379987533]
[{"$nulls":7},0.66,0.0388598276]
[{"$nulls":7},0.67,0.0397072693]
[{"$nulls":7},0.68,0.040540476]
[{"$nulls":7},0.69,0.0413588991]
[{"$nulls":7},0.7,0.0421620429]
[{"$nulls":7},0.71,0.0429494641]
[{"$nulls":7},0.72,0.0437207705]
[{"$nulls":7},0.73,0.04447562]
[{"$nulls":7},0.74,0.0452137189]
[{"$nulls":7},0.75,0.0459348212]
[{"$nulls":7},0.76,0.0466387261]
[{"$nulls":7},0.77,0.0473252771]
[{"$nulls":7},0.78,0.0479943599]
[{"$nulls":7},0.79,0.0486459007]
[{"$nulls":7},0.8,0.0492798642]
[{"$nulls":7},0.81,0.0498962518]
[{"$nulls":7},0.82,0.0504950998]
[{"$nulls":7},0.83,0.0510764772]
[{"$nulls":7},0.84,0.0516404838]
[{"$nulls":7},0.85,0.0521872484]
[{"$nulls":7},0.86,0.0527169267]
[{"$nulls":7},0.87,0.0532296993]
[{"$nulls":7},0.88,0.0537257701]
[{"$nulls":7},0.89,0.0542053641]
[{"$nulls":7},0.9,0.0546687257]
[{"$nulls":7},0.91,0.0551161169]
[{"$nulls":7},0.92,0.0555478158]
[{"$nulls":7},0.93,0.0559641145]
[{"$nulls":7},0.94,0.0563653178]
[{"$nulls":7},0.95,0.0567517415]
[{"$nulls":7},0.96,0.0571237109]
[{"$nulls":7},0.97,0.0574815594]
[{"$nulls":7},0.98,0.0578256274]
[{"$nulls":7},0.99,0.0581562605]
[{"$nulls":7},1,0.0584738086]
[{"$nulls":7},1.01,0.0587786248]
[{"$nulls":7},1.02,0.059071064]
[{"$nulls":7},1.03,0.0593514822]
[{"$nulls":7},1.04,0.0596202355]
[{"$nulls":7},1.05,0.0598776791]
[{"$nulls":7},1.06,0.0601241663]
[{"$nulls":7},1.07,0.0603600483]
[{"$nulls":7},1.08,0.060585673]
[{"$nulls":7},1.09,0.0608013846]
[{"$nulls":7},1.1,0.0610075229]
[{"$nulls":7},1.11,0.0612044228]
[{"$nulls":7},1.12,0.0613924139]
[{"$nulls":7},1.13,0.0615718202]
[{"$nulls":7},1.14,0.0617429593]
[{"$nulls":7},1.15,0.0619061425]
[{"$nulls":7},1.16,0.0620616744]
[{"$nulls":7},1.17,0.0622098525]
[{"$nulls":7},1.18,0.0623509673]
{"$rows_left_out":253}
{"sheet":"Feuil3","index":2,"n_rows":0,"n_cols":0,"rows_kept":0,"merged":[[9,2,9,3],[13,9,13,13]]}