{"text_format":"3","workbook":"xlsx","n_sheets":3,"sheets":["NGC2366","Integrale","Feuil3"],"not_rendered":{"charts":1},"read":"whole","date_system":"1900"}

{"sheet":"NGC2366","index":0,"n_rows":71,"n_cols":15,"rows_kept":71,"merged":[[9,2,9,3],[13,9,13,14]]}
[]
[]
[null,"ρ(r) = ρ0sech^8( r/ r_c)"]
[]
[]
["M(R) =4πρ0,r_c^3 ·I(u)",null,"u = R/r_c","I(u) = Integrale de 0 à u de ( x^2sech^8(x)dx",{"$nulls":3},"V_TURI(R) = Racine (G·M(R)/R)"]
[]
[{"$nulls":7},"G=",{"$f":"4.3009*POWER(10,-6)","v":4.3009000000000006E-6},"10^-6,KPC,(Km/s)^2/Mo"]
["NGC2366","R_max=",{"$f":"A40","v":6.06},"V_obs(R_max)=",{"$f":"B40","v":49.4}]
[null,"M_totale=","V_obs^2(R_max).R_max/G=",null,{"$f":"E9*E9*C9/I8","v":3438485340.277615},"Mo","I(infini)=",0.0648738184]
[{"$nulls":6},"M(R) = racine(G,M(R)/R)"]
[null,"r_c=R_max=",{"$f":"C9","v":6.06},"ρ0=M_tot/4.π.r_c^3.I(infini)=",{"$f":"E10/(POWER(C12,3)*4*3.14159*H10)","v":18952667.635545526},"Mo/kpc^3","π=",3.14159]
[]
["R","V_obs","Incer V_obs","u=R/r-c","I(U) par table","M(R) ","V_TURI","Erreur %",null,"calculs intermediaires de I(u)"]
[0.12,4.2,3.15,{"$f":"A15/$C$12","v":0.019801980198019802},{"$f":"N15*K15+O15*M15","v":2.9469623762376235E-6},{"$f":"4*$H$12*$E$12*POWER($C$12,3)*E15","v":156196.86306367858},{"$f":"POWER($I$8*F15/A15,0.5)","v":2.3660570019031226},{"$f":"ROUND(ABS((B15-G15)/B15)*100,2)","v":43.67},null,{"$f":"INDEX(Integrale!$H$3:$H$502,MATCH('NGC2366'!D15,Integrale!$H$3:$H$502,1))","v":0.01},{"$f":"INDEX(Integrale!$I$3:$I$502,MATCH('NGC2366'!D15,Integrale!$H$3:$H$502,1))","v":4.998e-07},{"$f":"INDEX(Integrale!$H$3:$H$502,MATCH('NGC2366'!D15,Integrale!$H$3:$H$502,1)+1)","v":0.02},{"$f":"INDEX(Integrale!$I$3:$I$502,MATCH('NGC2366'!D15,Integrale!$H$3:$H$502,1)+1)","v":2.9964e-06},{"$f":"(L15-D15)/(L15-J15)","v":0.01980198019801982},{"$f":"(D15-J15)/(L15-J15)","v":0.9801980198019802}]
[0.36,9.41,1.83,{"$f":"A16/$C$12","v":0.05940594059405941},{"$f":"N16*K16+O16*M16","v":7.0563782178217847E-5},{"$f":"4*$H$12*$E$12*POWER($C$12,3)*E16","v":3740068.5909732864},6.684488886576855,28.96,null,{"$f":"INDEX(Integrale!$H$3:$H$502,MATCH('NGC2366'!D16,Integrale!$H$3:$H$502,1))","v":0.05},{"$f":"INDEX(Integrale!$I$3:$I$502,MATCH('NGC2366'!D16,Integrale!$H$3:$H$502,1))","v":4.22345e-05},{"$f":"INDEX(Integrale!$H$3:$H$502,MATCH('NGC2366'!D16,Integrale!$H$3:$H$502,1)+1)","v":0.06},{"$f":"INDEX(Integrale!$I$3:$I$502,MATCH('NGC2366'!D16,Integrale!$H$3:$H$502,1)+1)","v":7.2353e-05},{"$f":"(L16-D16)/(L16-J16)","v":0.05940594059405879},0.9405940594059412]
[0.59,15.3,1.37,0.09735973597359736,3.0395622508250822E-4,16110490.330446271,10.836974362145112,29.17,null,{"$f":"INDEX(Integrale!$H$3:$H$502,MATCH('NGC2366'!D17,Integrale!$H$3:$H$502,1))","v":0.09},{"$f":"INDEX(Integrale!$I$3:$I$502,MATCH('NGC2366'!D17,Integrale!$H$3:$H$502,1))","v":0.0002397401},{"$f":"INDEX(Integrale!$H$3:$H$502,MATCH('NGC2366'!D17,Integrale!$H$3:$H$502,1)+1)","v":0.1},{"$f":"INDEX(Integrale!$I$3:$I$502,MATCH('NGC2366'!D17,Integrale!$H$3:$H$502,1)+1)","v":0.0003269934},0.2640264026402645,0.7359735973597356]
[0.83,18.4,1.64,0.13696369636963696,8.2340219966996664E-4,43642511.91845247,15.038187515358192,18.27,null,{"$f":"INDEX(Integrale!$H$3:$H$502,MATCH('NGC2366'!D18,Integrale!$H$3:$H$502,1))","v":0.13},{"$f":"INDEX(Integrale!$I$3:$I$502,MATCH('NGC2366'!D18,Integrale!$H$3:$H$502,1))","v":0.0007052805},{"$f":"INDEX(Integrale!$H$3:$H$502,MATCH('NGC2366'!D18,Integrale!$H$3:$H$502,1)+1)","v":0.14},{"$f":"INDEX(Integrale!$I$3:$I$502,MATCH('NGC2366'!D18,Integrale!$H$3:$H$502,1)+1)","v":0.0008749055},0.3036303630363055,0.6963696369636945]
[1.07,23.4,2.08,0.1765676567656766,1.7093391501650174E-3,90599532.35934402,19.083180653509743,18.45,null,{"$f":"INDEX(Integrale!$H$3:$H$502,MATCH('NGC2366'!D19,Integrale!$H$3:$H$502,1))","v":0.17},{"$f":"INDEX(Integrale!$I$3:$I$502,MATCH('NGC2366'!D19,Integrale!$H$3:$H$502,1))","v":0.001531222},{"$f":"INDEX(Integrale!$H$3:$H$502,MATCH('NGC2366'!D19,Integrale!$H$3:$H$502,1)+1)","v":0.18},{"$f":"INDEX(Integrale!$I$3:$I$502,MATCH('NGC2366'!D19,Integrale!$H$3:$H$502,1)+1)","v":1.8024255E-3},0.3432343234323405,0.6567656765676595]
[1.31,28.1,2.46,0.2161716171617162,0.003021336173927394,160138872.6349396,22.929385082049738,18.4,null,{"$f":"INDEX(Integrale!$H$3:$H$502,MATCH('NGC2366'!D20,Integrale!$H$3:$H$502,1))","v":0.21},{"$f":"INDEX(Integrale!$I$3:$I$502,MATCH('NGC2366'!D20,Integrale!$H$3:$H$502,1))","v":0.0027838579},{"$f":"INDEX(Integrale!$H$3:$H$502,MATCH('NGC2366'!D20,Integrale!$H$3:$H$502,1)+1)","v":0.22},{"$f":"INDEX(Integrale!$I$3:$I$502,MATCH('NGC2366'!D20,Integrale!$H$3:$H$502,1)+1)","v":0.0031686489},0.38283828382837914,0.6171617161716209]
[1.54,33.1,2.01,0.25412541254125415,0.004707109823102311,249489370.61201337,26.396438588798553,20.25,null,{"$f":"INDEX(Integrale!$H$3:$H$502,MATCH('NGC2366'!D21,Integrale!$H$3:$H$502,1))","v":0.25},{"$f":"INDEX(Integrale!$I$3:$I$502,MATCH('NGC2366'!D21,Integrale!$H$3:$H$502,1))","v":4.4997288E-3},{"$f":"INDEX(Integrale!$H$3:$H$502,MATCH('NGC2366'!D21,Integrale!$H$3:$H$502,1)+1)","v":0.26},{"$f":"INDEX(Integrale!$I$3:$I$502,MATCH('NGC2366'!D21,Integrale!$H$3:$H$502,1)+1)","v":0.0050024204},0.5874587458745856,0.41254125412541437]
[1.79,37.5,1.62,0.2953795379537954,0.007016771582508253,371907601.82741433,29.893081398119463,20.29,null,{"$f":"INDEX(Integrale!$H$3:$H$502,MATCH('NGC2366'!D22,Integrale!$H$3:$H$502,1))","v":0.29},{"$f":"INDEX(Integrale!$I$3:$I$502,MATCH('NGC2366'!D22,Integrale!$H$3:$H$502,1))","v":0.0066846487},{"$f":"INDEX(Integrale!$H$3:$H$502,MATCH('NGC2366'!D22,Integrale!$H$3:$H$502,1)+1)","v":0.3},{"$f":"INDEX(Integrale!$I$3:$I$502,MATCH('NGC2366'!D22,Integrale!$H$3:$H$502,1)+1)","v":0.0073020305},0.46204620462045837,0.5379537953795417]
[2.02,40.5,1.68,0.33333333333333337,0.00955602646666667,506494880.79058766,32.83912054266923,18.92,null,{"$f":"INDEX(Integrale!$H$3:$H$502,MATCH('NGC2366'!D23,Integrale!$H$3:$H$502,1))","v":0.33},{"$f":"INDEX(Integrale!$I$3:$I$502,MATCH('NGC2366'!D23,Integrale!$H$3:$H$502,1))","v":0.0093153237},{"$f":"INDEX(Integrale!$H$3:$H$502,MATCH('NGC2366'!D23,Integrale!$H$3:$H$502,1)+1)","v":0.34},{"$f":"INDEX(Integrale!$I$3:$I$502,MATCH('NGC2366'!D23,Integrale!$H$3:$H$502,1)+1)","v":0.010037432},0.6666666666666649,0.3333333333333352]
[2.26,42.3,1.69,0.3729372937293729,0.012581495902310228,666852827.316491,35.62381701190942,15.78,null,{"$f":"INDEX(Integrale!$H$3:$H$502,MATCH('NGC2366'!D24,Integrale!$H$3:$H$502,1))","v":0.37},{"$f":"INDEX(Integrale!$I$3:$I$502,MATCH('NGC2366'!D24,Integrale!$H$3:$H$502,1))","v":0.0123431779},{"$f":"INDEX(Integrale!$H$3:$H$502,MATCH('NGC2366'!D24,Integrale!$H$3:$H$502,1)+1)","v":0.38},{"$f":"INDEX(Integrale!$I$3:$I$502,MATCH('NGC2366'!D24,Integrale!$H$3:$H$502,1)+1)","v":0.0131545302},0.7062706270627099,0.29372937293729]
[2.49,45.2,1.91,0.410891089108911,0.01577831150099011,836292577.3225055,38.00660873522862,15.91,null,{"$f":"INDEX(Integrale!$H$3:$H$502,MATCH('NGC2366'!D25,Integrale!$H$3:$H$502,1))","v":0.41},{"$f":"INDEX(Integrale!$I$3:$I$502,MATCH('NGC2366'!D25,Integrale!$H$3:$H$502,1))","v":0.0156997951},{"$f":"INDEX(Integrale!$H$3:$H$502,MATCH('NGC2366'!D25,Integrale!$H$3:$H$502,1)+1)","v":0.42},{"$f":"INDEX(Integrale!$I$3:$I$502,MATCH('NGC2366'!D25,Integrale!$H$3:$H$502,1)+1)","v":0.0165809236},0.9108910891088998,0.08910891089110021]
[2.74,47.4,1.95,0.45214521452145223,{"$f":"N26*K26+O26*M26","v":0.019502601725412547},1033689888.8335506,40.28093335926453,15.02,null,{"$f":"INDEX(Integrale!$H$3:$H$502,MATCH('NGC2366'!D26,Integrale!$H$3:$H$502,1))","v":0.45},{"$f":"INDEX(Integrale!$I$3:$I$502,MATCH('NGC2366'!D26,Integrale!$H$3:$H$502,1))","v":0.0193032886},{"$f":"INDEX(Integrale!$H$3:$H$502,MATCH('NGC2366'!D26,Integrale!$H$3:$H$502,1)+1)","v":0.46},{"$f":"INDEX(Integrale!$I$3:$I$502,MATCH('NGC2366'!D26,Integrale!$H$3:$H$502,1)+1)","v":0.0202323944},0.7854785478547781,0.21452145214522192]
[2.97,48.1,1.74,{"$f":"A27/$C$12","v":0.49009900990099015},{"$f":"N27*K27+O27*M27","v":0.023074352840594062},{"$f":"4*$H$12*$E$12*POWER($C$12,3)*E27","v":1223002220.858574},{"$f":"POWER($I$8*F27/A27,0.5)","v":42.083811885230425},{"$f":"ROUND(ABS((B27-G27)/B27)*100,2)","v":12.51},null,{"$f":"INDEX(Integrale!$H$3:$H$502,MATCH('NGC2366'!D27,Integrale!$H$3:$H$502,1))","v":0.49},{"$f":"INDEX(Integrale!$I$3:$I$502,MATCH('NGC2366'!D27,Integrale!$H$3:$H$502,1))","v":0.0230649017},{"$f":"INDEX(Integrale!$H$3:$H$502,MATCH('NGC2366'!D27,Integrale!$H$3:$H$502,1)+1)","v":0.5},{"$f":"INDEX(Integrale!$I$3:$I$502,MATCH('NGC2366'!D27,Integrale!$H$3:$H$502,1)+1)","v":0.0240194669},{"$f":"(L27-D27)/(L27-J27)","v":0.9900990099009845},{"$f":"(D27-J27)/(L27-J27)","v":0.009900990099015452}]
[3.21,48.8,1.08,0.5297029702970297,0.02686673245049505,1424008451.3383305,43.68008146310367,10.49,null,{"$f":"INDEX(Integrale!$H$3:$H$502,MATCH('NGC2366'!D28,Integrale!$H$3:$H$502,1))","v":0.52},{"$f":"INDEX(Integrale!$I$3:$I$502,MATCH('NGC2366'!D28,Integrale!$H$3:$H$502,1))","v":0.0259359595},{"$f":"INDEX(Integrale!$H$3:$H$502,MATCH('NGC2366'!D28,Integrale!$H$3:$H$502,1)+1)","v":0.53},{"$f":"INDEX(Integrale!$I$3:$I$502,MATCH('NGC2366'!D28,Integrale!$H$3:$H$502,1)+1)","v":0.0268952255},0.0297029702970297,0.9702970297029703]
[3.44,50.7,1.55,0.5676567656765676,0.030487474593729375,1615917438.4689012,44.94796510614692,11.35,null,{"$f":"INDEX(Integrale!$H$3:$H$502,MATCH('NGC2366'!D29,Integrale!$H$3:$H$502,1))","v":0.56},{"$f":"INDEX(Integrale!$I$3:$I$502,MATCH('NGC2366'!D29,Integrale!$H$3:$H$502,1))","v":0.0297618021},{"$f":"INDEX(Integrale!$H$3:$H$502,MATCH('NGC2366'!D29,Integrale!$H$3:$H$502,1)+1)","v":0.57},{"$f":"INDEX(Integrale!$I$3:$I$502,MATCH('NGC2366'!D29,Integrale!$H$3:$H$502,1)+1)","v":0.0307095554},0.23432343234323322,0.7656765676567667]
[3.69,52.1,2.78,0.6089108910891089,0.03433206530891089,1819690996.7325702,46.053783239122424,11.61,null,{"$f":"INDEX(Integrale!$H$3:$H$502,MATCH('NGC2366'!D30,Integrale!$H$3:$H$502,1))","v":0.6},{"$f":"INDEX(Integrale!$I$3:$I$502,MATCH('NGC2366'!D30,Integrale!$H$3:$H$502,1))","v":0.0335137772},{"$f":"INDEX(Integrale!$H$3:$H$502,MATCH('NGC2366'!D30,Integrale!$H$3:$H$502,1)+1)","v":0.61},{"$f":"INDEX(Integrale!$I$3:$I$502,MATCH('NGC2366'!D30,Integrale!$H$3:$H$502,1)+1)","v":0.0344320783},0.10891089108910891,0.8910891089108911]
[3.92,53,2.98,0.6468646864686469,0.03772471112673268,1999510270.471117,46.83801254265847,11.63,null,{"$f":"INDEX(Integrale!$H$3:$H$502,MATCH('NGC2366'!D31,Integrale!$H$3:$H$502,1))","v":0.64},{"$f":"INDEX(Integrale!$I$3:$I$502,MATCH('NGC2366'!D31,Integrale!$H$3:$H$502,1))","v":0.037124703},{"$f":"INDEX(Integrale!$H$3:$H$502,MATCH('NGC2366'!D31,Integrale!$H$3:$H$502,1)+1)","v":0.65},{"$f":"INDEX(Integrale!$I$3:$I$502,MATCH('NGC2366'!D31,Integrale!$H$3:$H$502,1)+1)","v":0.0379987533},0.31353135313530983,0.6864686468646902]
[4.16,53.7,2.39,0.6864686468646866,0.04106988500198021,2176813404.68463,47.4398829395611,11.66,null,{"$f":"INDEX(Integrale!$H$3:$H$502,MATCH('NGC2366'!D32,Integrale!$H$3:$H$502,1))","v":0.68},{"$f":"INDEX(Integrale!$I$3:$I$502,MATCH('NGC2366'!D32,Integrale!$H$3:$H$502,1))","v":0.040540476},{"$f":"INDEX(Integrale!$H$3:$H$502,MATCH('NGC2366'!D32,Integrale!$H$3:$H$502,1)+1)","v":0.69},{"$f":"INDEX(Integrale!$I$3:$I$502,MATCH('NGC2366'!D32,Integrale!$H$3:$H$502,1)+1)","v":0.0413588991},0.35313531353134225,0.6468646864686578]
[4.4,51.2,2.21,0.7260726072607262,0.04417916095544555,2341613320.098092,47.8421759738344,6.56,null,{"$f":"INDEX(Integrale!$H$3:$H$502,MATCH('NGC2366'!D33,Integrale!$H$3:$H$502,1))","v":0.72},{"$f":"INDEX(Integrale!$I$3:$I$502,MATCH('NGC2366'!D33,Integrale!$H$3:$H$502,1))","v":0.0437207705},{"$f":"INDEX(Integrale!$H$3:$H$502,MATCH('NGC2366'!D33,Integrale!$H$3:$H$502,1)+1)","v":0.73},{"$f":"INDEX(Integrale!$I$3:$I$502,MATCH('NGC2366'!D33,Integrale!$H$3:$H$502,1)+1)","v":0.04447562},0.39273927392737795,0.607260726072622]
[4.64,51.6,1.45,0.7656765676567657,0.04702845142013201,2492633311.438962,48.06731677170049,6.85,null,{"$f":"INDEX(Integrale!$H$3:$H$502,MATCH('NGC2366'!D34,Integrale!$H$3:$H$502,1))","v":0.76},{"$f":"INDEX(Integrale!$I$3:$I$502,MATCH('NGC2366'!D34,Integrale!$H$3:$H$502,1))","v":0.0466387261},{"$f":"INDEX(Integrale!$H$3:$H$502,MATCH('NGC2366'!D34,Integrale!$H$3:$H$502,1)+1)","v":0.77},{"$f":"INDEX(Integrale!$I$3:$I$502,MATCH('NGC2366'!D34,Integrale!$H$3:$H$502,1)+1)","v":0.0473252771},0.43234323432342864,0.5676567656765713]
[4.87,51.5,1.84,0.8036303630363038,0.04950363527590759,2623824655.073148,48.13739631326298,6.53,null,{"$f":"INDEX(Integrale!$H$3:$H$502,MATCH('NGC2366'!D35,Integrale!$H$3:$H$502,1))","v":0.8},{"$f":"INDEX(Integrale!$I$3:$I$502,MATCH('NGC2366'!D35,Integrale!$H$3:$H$502,1))","v":0.0492798642},{"$f":"INDEX(Integrale!$H$3:$H$502,MATCH('NGC2366'!D35,Integrale!$H$3:$H$502,1)+1)","v":0.81},{"$f":"INDEX(Integrale!$I$3:$I$502,MATCH('NGC2366'!D35,Integrale!$H$3:$H$502,1)+1)","v":0.0498962518},0.6369636963696296,0.3630363036303704]
[5.11,50.4,2.53,0.8432343234323434,0.05181732515577559,2746456387.4127197,48.07901657641979,4.61,null,{"$f":"INDEX(Integrale!$H$3:$H$502,MATCH('NGC2366'!D36,Integrale!$H$3:$H$502,1))","v":0.84},{"$f":"INDEX(Integrale!$I$3:$I$502,MATCH('NGC2366'!D36,Integrale!$H$3:$H$502,1))","v":0.0516404838},{"$f":"INDEX(Integrale!$H$3:$H$502,MATCH('NGC2366'!D36,Integrale!$H$3:$H$502,1)+1)","v":0.85},{"$f":"INDEX(Integrale!$I$3:$I$502,MATCH('NGC2366'!D36,Integrale!$H$3:$H$502,1)+1)","v":0.0521872484},0.6765676567656581,0.32343234323434195]
[5.35,48.5,4.6,0.8828382838283828,0.05386189248943894,2854823907.2751226,47.90627949942008,1.22,null,{"$f":"INDEX(Integrale!$H$3:$H$502,MATCH('NGC2366'!D37,Integrale!$H$3:$H$502,1))","v":0.88},{"$f":"INDEX(Integrale!$I$3:$I$502,MATCH('NGC2366'!D37,Integrale!$H$3:$H$502,1))","v":0.0537257701},{"$f":"INDEX(Integrale!$H$3:$H$502,MATCH('NGC2366'!D37,Integrale!$H$3:$H$502,1)+1)","v":0.89},{"$f":"INDEX(Integrale!$I$3:$I$502,MATCH('NGC2366'!D37,Integrale!$H$3:$H$502,1)+1)","v":0.0542053641},0.7161716171617198,0.2838283828382801]
[5.59,50,5.91,0.9224422442244224,0.05564948610957096,2949571135.1829796,47.637965525901244,4.72,null,{"$f":"INDEX(Integrale!$H$3:$H$502,MATCH('NGC2366'!D38,Integrale!$H$3:$H$502,1))","v":0.92},{"$f":"INDEX(Integrale!$I$3:$I$502,MATCH('NGC2366'!D38,Integrale!$H$3:$H$502,1))","v":0.0555478158},{"$f":"INDEX(Integrale!$H$3:$H$502,MATCH('NGC2366'!D38,Integrale!$H$3:$H$502,1)+1)","v":0.93},{"$f":"INDEX(Integrale!$I$3:$I$502,MATCH('NGC2366'!D38,Integrale!$H$3:$H$502,1)+1)","v":0.0559641145},0.7557755775577595,0.24422442244224052]
[5.82,49,7.42,0.9603960396039605,0.05713788311782178,3028460144.950031,47.3074034248333,3.45,null,{"$f":"INDEX(Integrale!$H$3:$H$502,MATCH('NGC2366'!D39,Integrale!$H$3:$H$502,1))","v":0.96},{"$f":"INDEX(Integrale!$I$3:$I$502,MATCH('NGC2366'!D39,Integrale!$H$3:$H$502,1))","v":0.0571237109},{"$f":"INDEX(Integrale!$H$3:$H$502,MATCH('NGC2366'!D39,Integrale!$H$3:$H$502,1)+1)","v":0.97},{"$f":"INDEX(Integrale!$I$3:$I$502,MATCH('NGC2366'!D39,Integrale!$H$3:$H$502,1)+1)","v":0.0574815594},0.9603960396039493,0.03960396039605071]
[6.06,49.4,5.92,1,0.0584738086,3099267757.31917,46.90000720839527,5.06,null,{"$f":"INDEX(Integrale!$H$3:$H$502,MATCH('NGC2366'!D40,Integrale!$H$3:$H$502,1))","v":1},{"$f":"INDEX(Integrale!$I$3:$I$502,MATCH('NGC2366'!D40,Integrale!$H$3:$H$502,1))","v":0.0584738086},{"$f":"INDEX(Integrale!$H$3:$H$502,MATCH('NGC2366'!D40,Integrale!$H$3:$H$502,1)+1)","v":1.01},{"$f":"INDEX(Integrale!$I$3:$I$502,MATCH('NGC2366'!D40,Integrale!$H$3:$H$502,1)+1)","v":0.0587786248},1,0]
[{"$nulls":6},"Erreur moy",{"$f":"ROUND(AVERAGE(H15:H40),2)","v":14.28}]
[null,"Précision=",{"$f":"ROUND(MAX(0,100-H41),2)","v":85.72},"%"]
[]
["R","V_Obs","Incer V_Obs","V_TURI","A=(V_obs-V_TURI)^2","A/Incer V_Obs^2"]
[{"$f":"A15","v":0.12},{"$f":"B15","v":4.2},{"$f":"C15","v":3.15},{"$f":"ROUND(G15,2)","v":2.37},{"$f":"ROUND(POWER((B45-D45),2),2)","v":3.35},{"$f":"ROUND(E45/POWER(C45,2),2)","v":0.34}]
[{"$f":"A16","v":0.36},{"$f":"B16","v":9.41},1.83,{"$f":"ROUND(G16,2)","v":6.68},{"$f":"ROUND(POWER((B46-D46),2),2)","v":7.45},{"$f":"ROUND(E46/POWER(C46,2),2)","v":2.22}]
[0.59,15.3,1.37,10.84,19.89,10.6]
[0.83,18.4,1.64,15.04,11.29,4.2]
[1.07,23.4,2.08,19.08,18.66,4.31]
[1.31,28.1,2.46,22.93,26.73,4.42]
[1.54,33.1,2.01,26.4,44.89,11.11]
[1.79,37.5,1.62,29.89,57.91,22.07]
[2.02,40.5,1.68,32.84,58.68,20.79]
[2.26,42.3,1.69,35.62,44.62,15.62]
[2.49,45.2,1.91,38.01,51.7,14.17]
[2.74,47.4,1.95,40.28,50.69,13.33]
[2.97,{"$f":"B27","v":48.1},1.74,42.08,36.24,11.97]
[3.21,48.8,1.08,43.68,26.21,22.47]
[3.44,50.7,1.55,44.95,33.06,13.76]
[3.69,52.1,2.78,46.05,36.6,4.74]
[3.92,53,2.98,46.84,37.95,4.27]
[4.16,53.7,2.39,47.44,39.19,6.86]
[4.4,51.2,2.21,47.84,11.29,2.31]
[4.64,51.6,1.45,48.07,12.46,5.93]
[4.87,51.5,1.84,48.14,11.29,3.33]
[5.11,50.4,2.53,48.08,5.38,0.84]
[5.35,48.5,4.6,47.91,0.35,0.02]
[5.59,50,5.91,47.64,5.57,0.16]
[5.82,49,7.42,47.31,2.86,0.05]
[6.06,49.4,5.92,46.9,6.25,0.18]
[{"$nulls":4},"X^2/d_f=",{"$f":"ROUND(SUM(F45:F70)/(COUNT(F45:F70)),2)","v":7.7}]

{"sheet":"Integrale","index":1,"n_rows":372,"n_cols":9,"rows_kept":372}
[{"$nulls":7},"u","I(u) = Integrale de 0 à u de ( x^2sech^8(x)dx"]
[{"$nulls":7},0,0]
[{"$nulls":7},0.01,4.998e-07]
[{"$nulls":7},0.02,2.9964e-06]
[{"$nulls":7},0.03,9.477e-06]
[{"$nulls":7},0.04,2.19098e-05]
[{"$nulls":7},0.05,4.22345e-05]
[{"$nulls":7},0.06,7.2353e-05]
[{"$nulls":7},0.07,0.0001141207]
[{"$nulls":7},0.08,1.693376E-4]
[{"$nulls":7},0.09,0.0002397401]
[{"$nulls":7},0.1,0.0003269934]
[{"$nulls":7},0.11,0.0004326832]
[{"$nulls":7},0.12,0.0005583096]
[{"$nulls":7},0.13,0.0007052805]
[{"$nulls":7},0.14,0.0008749055]
[{"$nulls":7},0.15,1.0683906E-3]
[{"$nulls":7},0.16,0.001286834]
[{"$nulls":7},0.17,0.001531222]
[{"$nulls":7},0.18,1.8024255E-3]
[{"$nulls":7},0.19,0.0021011974]
[{"$nulls":7},0.2,0.0024281708]
[{"$nulls":7},0.21,0.0027838579]
[{"$nulls":7},0.22,0.0031686489]
[{"$nulls":7},0.23,0.0035828125]
[{"$nulls":7},0.24,0.0040264964]
[{"$nulls":7},0.25,4.4997288E-3]
[{"$nulls":7},0.26,0.0050024204]
[{"$nulls":7},0.27,5.5343666E-3]
[{"$nulls":7},0.28,0.006095251]
[{"$nulls":7},0.29,0.0066846487]
[{"$nulls":7},0.3,0.0073020305]
[{"$nulls":7},0.31,0.0079467677]
[{"$nulls":7},0.32,0.0086181365]
[{"$nulls":7},0.33,0.0093153237]
[{"$nulls":7},0.34,0.010037432]
[{"$nulls":7},0.35,0.0107834863]
[{"$nulls":7},0.36,0.0115524392]
[{"$nulls":7},0.37,0.0123431779]
[{"$nulls":7},0.38,0.0131545302]
[{"$nulls":7},0.39,0.0139852712]
[{"$nulls":7},0.4,0.0148341297]
[{"$nulls":7},0.41,0.0156997951]
[{"$nulls":7},0.42,0.0165809236]
[{"$nulls":7},0.43,0.0174761447]
[{"$nulls":7},0.44,0.0183840679]
[{"$nulls":7},0.45,0.0193032886]
[{"$nulls":7},0.46,0.0202323944]
[{"$nulls":7},0.47,0.0211699709]
[{"$nulls":7},0.48,0.0221146072]
[{"$nulls":7},0.49,0.0230649017]
[{"$nulls":7},0.5,0.0240194669]
[{"$nulls":7},0.51,0.0249769344]
[{"$nulls":7},0.52,0.0259359595]
[{"$nulls":7},0.53,0.0268952255]
[{"$nulls":7},0.54,0.0278534477]
[{"$nulls":7},0.55,0.0288093767]
[{"$nulls":7},0.56,0.0297618021]
[{"$nulls":7},0.57,0.0307095554]
[{"$nulls":7},0.58,0.0316515125]
[{"$nulls":7},0.59,0.0325865959]
[{"$nulls":7},0.6,0.0335137772]
[{"$nulls":7},0.61,0.0344320783]
[{"$nulls":7},0.62,0.0353405729]
[{"$nulls":7},0.63,0.0362383877]
[{"$nulls":7},0.64,0.037124703]
[{"$nulls":7},0.65,0.0379987533]
[{"$nulls":7},0.66,0.0388598276]
[{"$nulls":7},0.67,0.0397072693]
[{"$nulls":7},0.68,0.040540476]
[{"$nulls":7},0.69,0.0413588991]
[{"$nulls":7},0.7,0.0421620429]
[{"$nulls":7},0.71,0.0429494641]
[{"$nulls":7},0.72,0.0437207705]
[{"$nulls":7},0.73,0.04447562]
[{"$nulls":7},0.74,0.0452137189]
[{"$nulls":7},0.75,0.0459348212]
[{"$nulls":7},0.76,0.0466387261]
[{"$nulls":7},0.77,0.0473252771]
[{"$nulls":7},0.78,0.0479943599]
[{"$nulls":7},0.79,0.0486459007]
[{"$nulls":7},0.8,0.0492798642]
[{"$nulls":7},0.81,0.0498962518]
[{"$nulls":7},0.82,0.0504950998]
[{"$nulls":7},0.83,0.0510764772]
[{"$nulls":7},0.84,0.0516404838]
[{"$nulls":7},0.85,0.0521872484]
[{"$nulls":7},0.86,0.0527169267]
[{"$nulls":7},0.87,0.0532296993]
[{"$nulls":7},0.88,0.0537257701]
[{"$nulls":7},0.89,0.0542053641]
[{"$nulls":7},0.9,0.0546687257]
[{"$nulls":7},0.91,0.0551161169]
[{"$nulls":7},0.92,0.0555478158]
[{"$nulls":7},0.93,0.0559641145]
[{"$nulls":7},0.94,0.0563653178]
[{"$nulls":7},0.95,0.0567517415]
[{"$nulls":7},0.96,0.0571237109]
[{"$nulls":7},0.97,0.0574815594]
[{"$nulls":7},0.98,0.0578256274]
[{"$nulls":7},0.99,0.0581562605]
[{"$nulls":7},1,0.0584738086]
[{"$nulls":7},1.01,0.0587786248]
[{"$nulls":7},1.02,0.059071064]
[{"$nulls":7},1.03,0.0593514822]
[{"$nulls":7},1.04,0.0596202355]
[{"$nulls":7},1.05,0.0598776791]
[{"$nulls":7},1.06,0.0601241663]
[{"$nulls":7},1.07,0.0603600483]
[{"$nulls":7},1.08,0.060585673]
[{"$nulls":7},1.09,0.0608013846]
[{"$nulls":7},1.1,0.0610075229]
[{"$nulls":7},1.11,0.0612044228]
[{"$nulls":7},1.12,0.0613924139]
[{"$nulls":7},1.13,0.0615718202]
[{"$nulls":7},1.14,0.0617429593]
[{"$nulls":7},1.15,0.0619061425]
[{"$nulls":7},1.16,0.0620616744]
[{"$nulls":7},1.17,0.0622098525]
[{"$nulls":7},1.18,0.0623509673]
[{"$nulls":7},1.19,0.0624853017]
[{"$nulls":7},1.2,0.0626131314]
[{"$nulls":7},1.21,0.0627347243]
[{"$nulls":7},1.22,0.0628503409]
[{"$nulls":7},1.23,0.0629602337]
[{"$nulls":7},1.24,0.0630646479]
[{"$nulls":7},1.25,0.0631638207]
[{"$nulls":7},1.26,0.0632579818]
[{"$nulls":7},1.27,0.0633473531]
[{"$nulls":7},1.28,0.0634321492]
[{"$nulls":7},1.29,0.0635125771]
[{"$nulls":7},1.3,0.0635888365]
[{"$nulls":7},1.31,0.0636611197]
[{"$nulls":7},1.32,0.0637296121]
[{"$nulls":7},1.33,0.0637944919]
[{"$nulls":7},1.34,0.0638559305]
[{"$nulls":7},1.35,0.0639140927]
[{"$nulls":7},1.36,0.0639691366]
[{"$nulls":7},1.37,0.064021214]
[{"$nulls":7},1.38,0.0640704704]
[{"$nulls":7},1.39,0.0641170452]
[{"$nulls":7},1.4,0.064161072]
[{"$nulls":7},1.41,0.0642026787]
[{"$nulls":7},1.42,0.0642419876]
[{"$nulls":7},1.43,0.0642791157]
[{"$nulls":7},1.44,0.0643141746]
[{"$nulls":7},1.45,0.064347271]
[{"$nulls":7},1.46,0.064378507]
[{"$nulls":7},1.47,0.0644079795]
[{"$nulls":7},1.48,0.0644357814]
[{"$nulls":7},1.49,0.0644620009]
[{"$nulls":7},1.5,0.0644867222]
[{"$nulls":7},1.51,0.0645100253]
[{"$nulls":7},1.52,0.0645319867]
[{"$nulls":7},1.53,0.0645526787]
[{"$nulls":7},1.54,0.0645721705]
[{"$nulls":7},1.55,0.0645905275]
[{"$nulls":7},1.56,0.0646078121]
[{"$nulls":7},1.57,0.0646240835]
[{"$nulls":7},1.58,0.0646393978]
[{"$nulls":7},1.59,0.0646538084]
[{"$nulls":7},1.6,0.0646673658]
[{"$nulls":7},1.61,0.064680118]
[{"$nulls":7},1.62,0.0646921104]
[{"$nulls":7},1.63,0.0647033862]
[{"$nulls":7},1.64,0.0647139861]
[{"$nulls":7},1.65,0.0647239487]
[{"$nulls":7},1.66,0.0647333107]
[{"$nulls":7},1.67,0.0647421067]
[{"$nulls":7},1.68,0.0647503694]
[{"$nulls":7},1.69,0.0647581297]
[{"$nulls":7},1.7,0.064765417]
[{"$nulls":7},1.71,0.064772259]
[{"$nulls":7},1.72,0.0647786817]
[{"$nulls":7},1.73,0.0647847098]
[{"$nulls":7},1.74,0.0647903667]
[{"$nulls":7},1.75,0.0647956744]
[{"$nulls":7},1.76,0.0648006536]
[{"$nulls":7},1.77,0.064805324]
[{"$nulls":7},1.78,0.0648097041]
[{"$nulls":7},1.79,0.0648138112]
[{"$nulls":7},1.8,0.0648176618]
[{"$nulls":7},1.81,0.0648212714]
[{"$nulls":7},1.82,0.0648246547]
[{"$nulls":7},1.83,0.0648278252]
[{"$nulls":7},1.84,0.0648307961]
[{"$nulls":7},1.85,0.0648335795]
[{"$nulls":7},1.86,0.0648361869]
[{"$nulls":7},1.87,0.0648386291]
[{"$nulls":7},1.88,0.0648409162]
[{"$nulls":7},1.89,0.0648430578]
[{"$nulls":7},1.9,0.064845063]
[{"$nulls":7},1.91,0.0648469402]
[{"$nulls":7},1.92,0.0648486973]
[{"$nulls":7},1.93,0.0648503418]
[{"$nulls":7},1.94,0.0648518808]
[{"$nulls":7},1.95,0.0648533208]
[{"$nulls":7},1.96,0.0648546681]
[{"$nulls":7},1.97,0.0648559285]
[{"$nulls":7},1.98,0.0648571074]
{"$rows_left_out":173}
{"sheet":"Feuil3","index":2,"n_rows":0,"n_cols":0,"rows_kept":0}