*Heading
** Job name: Job-6 Model name: Job-6
** Generated by: Abaqus/CAE 2020
*Preprint, echo=NO, model=NO, history=NO, contact=NO
**
** PARTS
**
*Part, name=WP
*Node
*Element, type=CPS4
*Element, type=COH2D4
*Nset, nset=DIE
*Elset, elset=DIE
*Nset, nset=BONE
*Elset, elset=BONE, generate
*Elset, elset=COH, generate
*Elset, elset=__PICKEDSURF6_S3, internal, generate
*Elset, elset=_COHESIVESEAM-1-TOPSURF_S3, internal, generate
*Elset, elset=_COHESIVESEAM-1-BOTTOMSURF_S1, internal, generate
*Surface, type=ELEMENT, name=_PICKEDSURF6, internal
__PICKEDSURF6_S3, S3
*Surface, type=ELEMENT, name=COHESIVESEAM-1-TOPSURF
_COHESIVESEAM-1-TOPSURF_S3, S3
*Surface, type=ELEMENT, name=COHESIVESEAM-1-BOTTOMSURF
_COHESIVESEAM-1-BOTTOMSURF_S1, S1
** Section: Section-1-DIE
*Solid Section, elset=DIE, material=ST
6.35,
** Section: Section-2-BONE
*Solid Section, elset=BONE, material=LAYER
6.35,
** Section: Section-3-COH
*Cohesive Section, elset=COH, controls=EC-1, material=COH, response=TRACTION SEPARATION
, 6.35
*End Part
**
**
** ASSEMBLY
**
*Assembly, name=Assembly
**
*Instance, name=WP-1, part=WP
*End Instance
**
*Node
*Nset, nset=RPS-FACE-X0, instance=WP-1
*Elset, elset=RPS-FACE-X0, instance=WP-1
*Nset, nset=RPS-FACE-X1, instance=WP-1
*Elset, elset=RPS-FACE-X1, instance=WP-1
*Nset, nset=RPS-X0
*Nset, nset=RPS-X1
*Nset, nset=RPS-FACE-X0_CNS_, internal, instance=WP-1
*Nset, nset=RPS-FACE-X0_CNS__CNS_, internal, instance=WP-1
*Nset, nset=RPS-FACE-X0_CNS__CNS__CNS_, internal, instance=WP-1
*Nset, nset=RPS-FACE-X0_CNS__CNS__CNS__CNS_, internal, instance=WP-1
*Nset, nset=RPS-FACE-X0_CNS__CNS__CNS__CNS__CNS_, internal, instance=WP-1
*Nset, nset=RPS-FACE-X0_CNS__CNS__CNS__CNS__CNS__CNS_, internal, instance=WP-1
*Nset, nset=RPS-FACE-X0_CNS__CNS__CNS__CNS__CNS__CNS__CNS_, internal, instance=WP-1
*Nset, nset=RPS-FACE-X0_CNS__CNS__CNS__CNS__CNS__CNS__CNS__CNS_, internal, instance=WP-1
*Nset, nset=RPS-FACE-X0_CNS__CNS__CNS__CNS__CNS__CNS__CNS__CNS__CNS_, internal, instance=WP-1
*Nset, nset=RPS-FACE-X1_CNS_, internal, instance=WP-1
*Nset, nset=RPS-FACE-X1_CNS__CNS_, internal, instance=WP-1
*Nset, nset=RPS-FACE-X1_CNS__CNS__CNS_, internal, instance=WP-1
*Nset, nset=RPS-FACE-X1_CNS__CNS__CNS__CNS_, internal, instance=WP-1
*Nset, nset=RPS-FACE-X1_CNS__CNS__CNS__CNS__CNS_, internal, instance=WP-1
*Nset, nset=RPS-FACE-X1_CNS__CNS__CNS__CNS__CNS__CNS_, internal, instance=WP-1
*Nset, nset=RPS-FACE-X1_CNS__CNS__CNS__CNS__CNS__CNS__CNS_, internal, instance=WP-1
*Nset, nset=RPS-FACE-X1_CNS__CNS__CNS__CNS__CNS__CNS__CNS__CNS_, internal, instance=WP-1
*Nset, nset=RPS-FACE-X1_CNS__CNS__CNS__CNS__CNS__CNS__CNS__CNS__CNS_, internal, instance=WP-1
*Nset, nset=_PICKEDSET28, internal
*Nset, nset=_PICKEDSET31, internal
*Nset, nset=_PICKEDSET33, internal
*Nset, nset=_PICKEDSET35, internal
*Nset, nset=_PICKEDSET36, internal
*Nset, nset=_PICKEDSET37, internal
*Surface, type=NODE, name=RPS-FACE-X0_CNS__CNS__CNS__CNS__CNS__CNS__CNS__CNS__CNS__CNS_, internal
RPS-FACE-X0_CNS__CNS__CNS__CNS__CNS__CNS__CNS__CNS__CNS_, 1.
*Surface, type=NODE, name=RPS-FACE-X1_CNS__CNS__CNS__CNS__CNS__CNS__CNS__CNS__CNS__CNS_, internal
RPS-FACE-X1_CNS__CNS__CNS__CNS__CNS__CNS__CNS__CNS__CNS_, 1.
** Constraint: CONSTRAINT-1
*Coupling, constraint name=CONSTRAINT-1, ref node=RPS-X0, surface=RPS-FACE-X0_CNS__CNS__CNS__CNS__CNS__CNS__CNS__CNS__CNS__CNS_
*Kinematic
** Constraint: CONSTRAINT-2
*Coupling, constraint name=CONSTRAINT-2, ref node=RPS-X1, surface=RPS-FACE-X1_CNS__CNS__CNS__CNS__CNS__CNS__CNS__CNS__CNS__CNS_
*Kinematic
*End Assembly
**
** ELEMENT CONTROLS
**
*Section Controls, name=EC-1, ELEMENT DELETION=YES, MAX DEGRADATION=1., hourglass=STIFFNESS, VISCOSITY=0.001
**
** MATERIALS
**
*Material, name=COH
*Damage Initiation, criterion=MAXS
45.,20.,20.
*Damage Evolution, type=ENERGY, mixed mode behavior=BK, power=1.45
 1.54, 2.11, 2.11
*Elastic, type=TRACTION
100000.,100000.,100000.
*Material, name=LAYER
*Depvar
*User Material, constants=15
*Material, name=ST
*Elastic
220000., 0.3
**
** BOUNDARY CONDITIONS
**
** Name: Disp-BC-1 Type: Î»ÒÆ/×ª½Ç
*Boundary
_PICKEDSET37, 2, 2
** Name: Disp-BC-2 Type: Î»ÒÆ/×ª½Ç
*Boundary
_PICKEDSET31, 2, 2
** Name: Disp-BC-3 Type: Î»ÒÆ/×ª½Ç
*Boundary
_PICKEDSET33, 6, 6
** Name: Disp-BC-4 Type: Î»ÒÆ/×ª½Ç
*Boundary
_PICKEDSET28, 6, 6
** ----------------------------------------------------------------
**
** STEP: Step-1
**
*Step, name=Step-1, nlgeom=YES, inc=100000
*Static, stabilize=0.0002, allsdtol=0.05, continue=NO
0.01, 1333., 1e-05, 0.1
**
** BOUNDARY CONDITIONS
**
** Name: Disp-BC-5 Type: Î»ÒÆ/×ª½Ç
*Boundary
_PICKEDSET35, 1, 1, -3.6
** Name: Disp-BC-6 Type: Î»ÒÆ/×ª½Ç
*Boundary
_PICKEDSET36, 1, 1, 3.6
**
** OUTPUT REQUESTS
**
*Restart, write, number interval=1, time marks=NO
**
** FIELD OUTPUT: F-Output-1
**
*Output, field, number interval=200
*Element Output, directions=YES
LE, S, SDEG, SDV, STATUS
**
** FIELD OUTPUT: F-Output-2
**
*Node Output
RF, U
**
** HISTORY OUTPUT: H-Output-1
**
*Output, history, frequency=100
*Node Output, nset=RPS-FACE-X0
RF1, U1
**
** HISTORY OUTPUT: H-Output-2
**
*Node Output, nset=RPS-FACE-X1
RF1, U1
**
** HISTORY OUTPUT: H-Output-3
**
*Output, history, variable=PRESELECT, frequency=100
*End Step